{"text_format":"1","workbook":"xlsx","n_sheets":7,"sheets":["前月分","勤務表","夜勤データ","勤務合わせ","S1","S2","S3"],"not_rendered":{"charts":0,"images":3,"macros":1,"external_links":0,"defined_names":1,"comments":1,"pivot_tables":0},"unopened":[],"bounds":{"document_bytes":16777216,"sheet_cells":100000,"rows_first":2000,"rows_last":500,"rows_between":2000,"halvings":0,"cell_chars":16384,"cell_head_chars":4096},"cells_cut":0,"cells_raw":0,"read":"whole","date_system":"1900"}

{"sheet":"前月分","index":0,"n_rows":33,"n_cols":34,"rows_kept":33,"cut":false,"hidden":false,"merged":[]}
[]
[29,null,"人中",12.5,16,11.5,12.5,8.5,9,12.5,12,14.5,11.5,12,10.5,9,14,11.5,17,11.5,11,10,10,12,11.5,17,11.5,11.5,10.5,8,12,12.5,18,0]
[null,null,"2022-11-01",1,2,3,4,5,6,7,8,9,10,11,12,13,14,15,16,17,18,19,20,21,22,23,24,25,26,27,28,29,30,31]
[null,null,"ソート","火","水","木","金","土","日","月","火","水","木","金","土","日","月","火","水","木","金","土","日","月","火","水","木","金","土","日","月","火","水","木"]
[null,null,"小川　季美","〇","〇","〇","〇","公","公","〇","公","公","〇","〇","〇","公","〇","〇","〇","〇","〇","公","公","〇","〇","〇","有","〇","公","公","〇","〇","〇"]
[null,null,"松永　健","〇","〇","公","②","〇","公","〇","〇","〇","有","―","―","公","〇","―","―","公","―","―","公","②","公","〇","〇","公","―","―","公","公","〇"]
[null,null,"土田　尚徳","〇","〇","―","―","公","〇","〇","―","―","公","公","公","〇","〇","公","①","―","―","公","〇","〇","公","〇","〇","―","―","公","公","②","〇"]
[null,null,"森田　りよ子","公","公","―","―","公","〇","〇","―","―","公","〇","〇","〇","公","〇","〇","公","〇","②","―","―","公","〇","―","―","公","②","〇","公","〇"]
[null,null,"柴田　由美","公","―","―","公","公","①","有","〇","〇","①","公","―","―","公","〇","―","―","公","〇","②","公","〇","―","―","公","〇","〇","―","―","公"]
[null,null,"牛根　嘉孝","―","―","公","〇","公","②","―","―","〇","〇","〇","―","―","公","公","〇","公","①","―","―","公","公","〇","〇","公","有","公","〇","〇","―"]
[null,null,"小山　智","―","公","公","〇","―","―","公","②","〇","―","―","公","①","―","―","公","〇","〇","公","〇","―","―","公","公","〇","①","―","―","公","〇"]
[null,null,"徳島　照代","〇","〇","公","〇","公","公","公","〇","〇","有","〇","公","公","〇","〇","〇","〇","〇","〇","公","〇","〇","公","〇","〇","有","公","〇","〇","〇"]
[null,null,"林　　 和重","〇","―","―","公","①","―","―","公","〇","〇","公","〇","―","―","公","〇","②","公","〇","―","―","公","〇","―","―","公","①","公","公","②"]
[null,null,"田中　ゆかり","―","公","〇","公","●","公","①","〇","公","●","公","●","〇","―","―","公","●","②","●","公","公","〇","①","●","①","●","―","―","公","―"]
[null,null,"大淵　倫子","―","―",null,"―","―",null,null,null,"―","―",null,null,null,null,"―","―",null,"―","―",null,null,"―","―",null,"―","―",null,null,"―","―"]
[null,null,"松尾　眞理","〇","②","〇",null,null,null,"〇",null,"有","〇","〇",null,"②","〇",null,"〇","有",null,null,null,"〇",null,"〇","〇",null,"②",null,"〇",null,"〇"]
[null,null,"松元　照哉",null,"〇","〇",null,"〇","〇",null,null,"〇","〇",null,"〇","〇",null,null,"〇","〇",null,"〇","〇",null,"〇","〇",null,"〇",null,null,null,"〇","〇"]
[null,null,"斉藤　京子","有","公","①","〇","公","〇","―","―","公","公","②","〇","―","―","公","有","〇","公","―","―","公","〇","〇","①","公","〇","〇","―","―","公"]
[null,null,"角　　 智美","公","〇","公","〇","―","―","公","①","公","有","―","―","公","②","〇","〇","公","〇","公","〇","―","―","公","有","〇","―","―","公","①","〇"]
[null,null,"古賀　美奈子","①","〇","〇","公","②","―","―","公","①","―","―","有","公","〇","公","〇","―","―","公","①","公","〇","―","―","公","公","〇","①","〇","公"]
[null,null,"後藤　徹矢","公","〇","②","―","―","公","〇","〇","―","―","公","公","公","〇","②","―","―","公","①","〇","〇","―","―","公","公","〇","公","②","―","―"]
[null,null,"瀬戸口　真紀","〇","〇","公","〇","〇","公","〇","〇","〇","公","〇","公","公","〇","〇","〇","〇","公","〇","公","〇","〇","公","〇","〇","〇","公","〇","〇","〇"]
[null,null,"井出　八千代",null,"◑","◑",null,"◑",null,null,"◑",null,"◑","◑","◑",null,"◑",null,"◑","◑","◑",null,null,"◑",null,"◑","◑",null,"◑",null,"◑",null,"◑"]
[null,null,"斉藤　洋子","〇","〇","公","①","公","〇","〇","公","公","〇","〇","〇","〇","公","①","〇","〇","有","公","〇","〇","公","〇","〇","公","〇","公","〇","〇","〇"]
[null,null,"白水　恵美子","ー","ー","公","〇","ー","ー","公","公","②","ー","ー","公","公","①","ー","ー","公","〇","〇","有","有","公","②","ー","ー","公","〇","公","ー","ー"]
[null,null,"赤松　修","ー","公","〇","ー","ー","公","〇","〇","ー","ー","公","②","公","ー","ー","公","①","〇","ー","ー","公","〇","ー","ー","有","公","公","ー","ー","公"]
[null,null,"林　　 恵理","②","ー","ー","公","〇","有","ー","ー","公","公","①","ー","ー","公","〇","ー","ー","公","公","ー","ー","公","〇","②","ー","ー","公","公","〇","〇"]
[null,null,"工藤　里美","公","①","〇","公","有","ー","ー","公","〇","②","ー","ー","公","〇","〇","公","ー","ー","公","〇","ー","ー","公","〇","②","ー","ー","公","公","ー"]
[null,null,"友池　明日香","公","〇","ー","ー","公","公","②","ー","ー","公","〇","①","ー","ー","公","②","公","ー","ー","公","①","ー","ー","公","〇","〇","ー","ー","公","①"]
[null,null,"日高 幸江","〇","公","公","〇","〇","〇","公","〇","〇","〇","公","〇","〇","〇","公","〇","〇","公","〇","公","〇","〇","〇","公","〇","公","〇","〇","有","〇"]
[null,null,"鎌田　幸一","有","〇","〇","〇","公","公","〇","公","〇","〇","公","〇","〇","〇","公","〇","〇","公","〇","公","有","〇","〇","公","〇","〇","公","〇","〇","〇"]
[null,null,"宮元　優子","〇","〇","〇","公","〇","〇","公","〇","〇","〇","〇","公","公","公","〇","〇","公","〇","公","〇","〇","有","〇","〇","公","〇","〇","公","〇","〇"]
[null,null,"谷口　篤志","◑","◑",null,"◑",null,null,"◑","◑","◑",null,"◑",null,null,"◑","◑","◑",null,"◑",null,null,"◑","◑","◑",null,"◑",null,null,"◑","◑","◑"]

{"sheet":"勤務表","index":1,"n_rows":38,"n_cols":34,"rows_kept":38,"cut":false,"hidden":false,"merged":[]}
[]
[{"$f":"COUNTA($C$5:$C$999076)","v":34},null,"人中",{"$f":"COUNTIF(D5:D999076,\"〇\")+COUNTIF(D5:D999076,\"○\")+COUNTIF(D5:D999076,\"②\")+COUNTIF(D5:D999076,\"①\")+(COUNTIF(D5:D999076,\"◐\")/2)+(COUNTIF(D5:D999076,\"◑\")/2)","v":16},{"$f":"COUNTIF(E5:E999076,\"〇\")+COUNTIF(E5:E999076,\"○\")+COUNTIF(E5:E999076,\"②\")+COUNTIF(E5:E999076,\"①\")+(COUNTIF(E5:E999076,\"◐\")/2)+(COUNTIF(E5:E999076,\"◑\")/2)","v":13.5},{"$f":"COUNTIF(F5:F999076,\"〇\")+COUNTIF(F5:F999076,\"○\")+COUNTIF(F5:F999076,\"②\")+COUNTIF(F5:F999076,\"①\")+(COUNTIF(F5:F999076,\"◐\")/2)+(COUNTIF(F5:F999076,\"◑\")/2)","v":9.5},{"$f":"COUNTIF(G5:G999076,\"〇\")+COUNTIF(G5:G999076,\"○\")+COUNTIF(G5:G999076,\"②\")+COUNTIF(G5:G999076,\"①\")+(COUNTIF(G5:G999076,\"◐\")/2)+(COUNTIF(G5:G999076,\"◑\")/2)","v":8.5},{"$f":"COUNTIF(H5:H999076,\"〇\")+COUNTIF(H5:H999076,\"○\")+COUNTIF(H5:H999076,\"②\")+COUNTIF(H5:H999076,\"①\")+(COUNTIF(H5:H999076,\"◐\")/2)+(COUNTIF(H5:H999076,\"◑\")/2)","v":15},{"$f":"COUNTIF(I5:I999076,\"〇\")+COUNTIF(I5:I999076,\"○\")+COUNTIF(I5:I999076,\"②\")+COUNTIF(I5:I999076,\"①\")+(COUNTIF(I5:I999076,\"◐\")/2)+(COUNTIF(I5:I999076,\"◑\")/2)","v":12.5},{"$f":"COUNTIF(J5:J999076,\"〇\")+COUNTIF(J5:J999076,\"○\")+COUNTIF(J5:J999076,\"②\")+COUNTIF(J5:J999076,\"①\")+(COUNTIF(J5:J999076,\"◐\")/2)+(COUNTIF(J5:J999076,\"◑\")/2)","v":16.5},{"$f":"COUNTIF(K5:K999076,\"〇\")+COUNTIF(K5:K999076,\"○\")+COUNTIF(K5:K999076,\"②\")+COUNTIF(K5:K999076,\"①\")+(COUNTIF(K5:K999076,\"◐\")/2)+(COUNTIF(K5:K999076,\"◑\")/2)","v":13},{"$f":"COUNTIF(L5:L999076,\"〇\")+COUNTIF(L5:L999076,\"○\")+COUNTIF(L5:L999076,\"②\")+COUNTIF(L5:L999076,\"①\")+(COUNTIF(L5:L999076,\"◐\")/2)+(COUNTIF(L5:L999076,\"◑\")/2)","v":14},{"$f":"COUNTIF(M5:M999076,\"〇\")+COUNTIF(M5:M999076,\"○\")+COUNTIF(M5:M999076,\"②\")+COUNTIF(M5:M999076,\"①\")+(COUNTIF(M5:M999076,\"◐\")/2)+(COUNTIF(M5:M999076,\"◑\")/2)","v":9},{"$f":"COUNTIF(N5:N999076,\"〇\")+COUNTIF(N5:N999076,\"○\")+COUNTIF(N5:N999076,\"②\")+COUNTIF(N5:N999076,\"①\")+(COUNTIF(N5:N999076,\"◐\")/2)+(COUNTIF(N5:N999076,\"◑\")/2)","v":8.5},{"$f":"COUNTIF(O5:O999076,\"〇\")+COUNTIF(O5:O999076,\"○\")+COUNTIF(O5:O999076,\"②\")+COUNTIF(O5:O999076,\"①\")+(COUNTIF(O5:O999076,\"◐\")/2)+(COUNTIF(O5:O999076,\"◑\")/2)","v":13},{"$f":"COUNTIF(P5:P999076,\"〇\")+COUNTIF(P5:P999076,\"○\")+COUNTIF(P5:P999076,\"②\")+COUNTIF(P5:P999076,\"①\")+(COUNTIF(P5:P999076,\"◐\")/2)+(COUNTIF(P5:P999076,\"◑\")/2)","v":12.5},{"$f":"COUNTIF(Q5:Q999076,\"〇\")+COUNTIF(Q5:Q999076,\"○\")+COUNTIF(Q5:Q999076,\"②\")+COUNTIF(Q5:Q999076,\"①\")+(COUNTIF(Q5:Q999076,\"◐\")/2)+(COUNTIF(Q5:Q999076,\"◑\")/2)","v":16.5},{"$f":"COUNTIF(R5:R999076,\"〇\")+COUNTIF(R5:R999076,\"○\")+COUNTIF(R5:R999076,\"②\")+COUNTIF(R5:R999076,\"①\")+(COUNTIF(R5:R999076,\"◐\")/2)+(COUNTIF(R5:R999076,\"◑\")/2)","v":12},{"$f":"COUNTIF(S5:S999076,\"〇\")+COUNTIF(S5:S999076,\"○\")+COUNTIF(S5:S999076,\"②\")+COUNTIF(S5:S999076,\"①\")+(COUNTIF(S5:S999076,\"◐\")/2)+(COUNTIF(S5:S999076,\"◑\")/2)","v":14.5},{"$f":"COUNTIF(T5:T999076,\"〇\")+COUNTIF(T5:T999076,\"○\")+COUNTIF(T5:T999076,\"②\")+COUNTIF(T5:T999076,\"①\")+(COUNTIF(T5:T999076,\"◐\")/2)+(COUNTIF(T5:T999076,\"◑\")/2)","v":10.5},{"$f":"COUNTIF(U5:U999076,\"〇\")+COUNTIF(U5:U999076,\"○\")+COUNTIF(U5:U999076,\"②\")+COUNTIF(U5:U999076,\"①\")+(COUNTIF(U5:U999076,\"◐\")/2)+(COUNTIF(U5:U999076,\"◑\")/2)","v":8},{"$f":"COUNTIF(V5:V999076,\"〇\")+COUNTIF(V5:V999076,\"○\")+COUNTIF(V5:V999076,\"②\")+COUNTIF(V5:V999076,\"①\")+(COUNTIF(V5:V999076,\"◐\")/2)+(COUNTIF(V5:V999076,\"◑\")/2)","v":16.5},{"$f":"COUNTIF(W5:W999076,\"〇\")+COUNTIF(W5:W999076,\"○\")+COUNTIF(W5:W999076,\"②\")+COUNTIF(W5:W999076,\"①\")+(COUNTIF(W5:W999076,\"◐\")/2)+(COUNTIF(W5:W999076,\"◑\")/2)","v":17},{"$f":"COUNTIF(X5:X999076,\"〇\")+COUNTIF(X5:X999076,\"○\")+COUNTIF(X5:X999076,\"②\")+COUNTIF(X5:X999076,\"①\")+(COUNTIF(X5:X999076,\"◐\")/2)+(COUNTIF(X5:X999076,\"◑\")/2)","v":16.5},{"$f":"COUNTIF(Y5:Y999076,\"〇\")+COUNTIF(Y5:Y999076,\"○\")+COUNTIF(Y5:Y999076,\"②\")+COUNTIF(Y5:Y999076,\"①\")+(COUNTIF(Y5:Y999076,\"◐\")/2)+(COUNTIF(Y5:Y999076,\"◑\")/2)","v":15},{"$f":"COUNTIF(Z5:Z999076,\"〇\")+COUNTIF(Z5:Z999076,\"○\")+COUNTIF(Z5:Z999076,\"②\")+COUNTIF(Z5:Z999076,\"①\")+(COUNTIF(Z5:Z999076,\"◐\")/2)+(COUNTIF(Z5:Z999076,\"◑\")/2)","v":17},{"$f":"COUNTIF(AA5:AA999076,\"〇\")+COUNTIF(AA5:AA999076,\"○\")+COUNTIF(AA5:AA999076,\"②\")+COUNTIF(AA5:AA999076,\"①\")+(COUNTIF(AA5:AA999076,\"◐\")/2)+(COUNTIF(AA5:AA999076,\"◑\")/2)","v":9.5},{"$f":"COUNTIF(AB5:AB999076,\"〇\")+COUNTIF(AB5:AB999076,\"○\")+COUNTIF(AB5:AB999076,\"②\")+COUNTIF(AB5:AB999076,\"①\")+(COUNTIF(AB5:AB999076,\"◐\")/2)+(COUNTIF(AB5:AB999076,\"◑\")/2)","v":9},{"$f":"COUNTIF(AC5:AC999076,\"〇\")+COUNTIF(AC5:AC999076,\"○\")+COUNTIF(AC5:AC999076,\"②\")+COUNTIF(AC5:AC999076,\"①\")+(COUNTIF(AC5:AC999076,\"◐\")/2)+(COUNTIF(AC5:AC999076,\"◑\")/2)","v":15.5},{"$f":"COUNTIF(AD5:AD999076,\"〇\")+COUNTIF(AD5:AD999076,\"○\")+COUNTIF(AD5:AD999076,\"②\")+COUNTIF(AD5:AD999076,\"①\")+(COUNTIF(AD5:AD999076,\"◐\")/2)+(COUNTIF(AD5:AD999076,\"◑\")/2)","v":13.5},{"$f":"COUNTIF(AE5:AE999076,\"〇\")+COUNTIF(AE5:AE999076,\"○\")+COUNTIF(AE5:AE999076,\"②\")+COUNTIF(AE5:AE999076,\"①\")+(COUNTIF(AE5:AE999076,\"◐\")/2)+(COUNTIF(AE5:AE999076,\"◑\")/2)","v":19.5},{"$f":"COUNTIF(AF5:AF999076,\"〇\")+COUNTIF(AF5:AF999076,\"○\")+COUNTIF(AF5:AF999076,\"②\")+COUNTIF(AF5:AF999076,\"①\")+(COUNTIF(AF5:AF999076,\"◐\")/2)+(COUNTIF(AF5:AF999076,\"◑\")/2)","v":14},{"$f":"COUNTIF(AG5:AG999076,\"〇\")+COUNTIF(AG5:AG999076,\"○\")+COUNTIF(AG5:AG999076,\"②\")+COUNTIF(AG5:AG999076,\"①\")+(COUNTIF(AG5:AG999076,\"◐\")/2)+(COUNTIF(AG5:AG999076,\"◑\")/2)","v":14.5},{"$f":"COUNTIF(AH5:AH999076,\"〇\")+COUNTIF(AH5:AH999076,\"○\")+COUNTIF(AH5:AH999076,\"②\")+COUNTIF(AH5:AH999076,\"①\")+(COUNTIF(AH5:AH999076,\"◐\")/2)+(COUNTIF(AH5:AH999076,\"◑\")/2)","v":10}]
[null,null,"2022-12-01",1,2,3,4,5,6,7,8,9,10,11,12,13,14,15,16,17,18,19,20,21,22,23,24,25,26,27,28,29,30,31]
[null,null,"ソート",{"$f":"TEXT($C$3,\"aaa\")","v":"木"},{"$f":"TEXT($C$3+1,\"aaa\")","v":"金"},{"$f":"TEXT($C$3+2,\"aaa\")","v":"土"},{"$f":"TEXT($C$3+3,\"aaa\")","v":"日"},{"$f":"TEXT($C$3+4,\"aaa\")","v":"月"},{"$f":"TEXT($C$3+5,\"aaa\")","v":"火"},{"$f":"TEXT($C$3+6,\"aaa\")","v":"水"},{"$f":"TEXT($C$3+7,\"aaa\")","v":"木"},{"$f":"TEXT($C$3+8,\"aaa\")","v":"金"},{"$f":"TEXT($C$3+9,\"aaa\")","v":"土"},{"$f":"TEXT($C$3+10,\"aaa\")","v":"日"},{"$f":"TEXT($C$3+11,\"aaa\")","v":"月"},{"$f":"TEXT($C$3+12,\"aaa\")","v":"火"},{"$f":"TEXT($C$3+13,\"aaa\")","v":"水"},{"$f":"TEXT($C$3+14,\"aaa\")","v":"木"},{"$f":"TEXT($C$3+15,\"aaa\")","v":"金"},{"$f":"TEXT($C$3+16,\"aaa\")","v":"土"},{"$f":"TEXT($C$3+17,\"aaa\")","v":"日"},{"$f":"TEXT($C$3+18,\"aaa\")","v":"月"},{"$f":"TEXT($C$3+19,\"aaa\")","v":"火"},{"$f":"TEXT($C$3+20,\"aaa\")","v":"水"},{"$f":"TEXT($C$3+21,\"aaa\")","v":"木"},{"$f":"TEXT($C$3+22,\"aaa\")","v":"金"},{"$f":"TEXT($C$3+23,\"aaa\")","v":"土"},{"$f":"TEXT($C$3+24,\"aaa\")","v":"日"},{"$f":"TEXT($C$3+25,\"aaa\")","v":"月"},{"$f":"TEXT($C$3+26,\"aaa\")","v":"火"},{"$f":"TEXT($C$3+27,\"aaa\")","v":"水"},{"$f":"TEXT($C$3+28,\"aaa\")","v":"木"},{"$f":"TEXT($C$3+29,\"aaa\")","v":"金"},{"$f":"TEXT($C$3+30,\"aaa\")","v":"土"}]
[null,null,"小川　季美","〇","〇","公","公","〇","公","〇","〇","〇","公","〇","〇","有","〇","〇","〇","公","公","〇","〇","〇","〇","〇","〇","公","公","公","〇","〇","〇","公"]
[null,null,"松永　健","〇","〇","公","〇","公","〇","―","―","公","〇","公","―","―","公","公","有","〇","―","―","公","②","―","―","公","〇","〇","〇","公","―","―","公"]
[null,null,"土田　尚徳","公","〇","〇","―","―","公","公","公","〇","―","―","公","〇","〇","―","―","公","〇","公","〇","―","―","公","②","―","―","公","〇","〇","公","〇"]
[null,null,"森田　りよ子","②","―","―","公","〇","①","公","公","公","公","公","有","有","有","有","有","有","有","有","有","有","〇","公","〇","①","公","〇","〇","公","〇","公"]
[null,null,"柴田　由美","〇","〇","有","有","②","―","―","公","公","〇","〇","〇","公","公","〇","②","―","―","公","―","―","公","〇","―","―","公","①","―","―","公","公"]
[null,null,"牛根　嘉孝","―","公","―","―","公","公","①","―","―","有","有","公","公","〇","公","〇","―","―","公","①","〇","公","①","―","―","公","―","―","公","〇","―"]
[null,null,"田中　公英","〇","公","公","〇","〇","〇","―","―","公","公","②","公","〇","―","―","有","公","①","〇","〇","公","②","―","―","公","〇","公","〇","〇","②","公"]
[null,null,"徳島　照代","公","公","〇","公","〇","〇","〇","〇","〇","公","公","〇","〇","〇","〇","〇","公","有","〇","〇","公","〇","〇","公","公","〇","〇","〇","〇","公","〇"]
[null,null,"林　　 和重","―","―","公","〇","―","―","公","〇","公","〇","―","―","公","〇","②","―","―","公","②","公","①","公","〇","公","〇","―","―","公","公","〇","〇"]
[null,null,"田中　ゆかり","●","公","●","公","公","公","②","●","公","●","①","―","―","公","●","公","●","〇","公","―","―","有","公","●","②","―","―","公","●","―","―"]
[null,null,"奥村　綾華","○","○","公","公","○","○","○","○","○","公","公","○","○","○","公","○","〇","公","○","○","○","○","○","公","公","○","○","○","○","公","公"]
[null,null,"大淵　倫子","―","―",null,null,"―","―",null,"―","―",null,null,null,"―","―",null,"―","―",null,"―","―",null,"―","―",null,null,null,"―","―",null,"―","―"]
[null,null,"松尾　眞理","〇",null,"〇","②",null,"〇",null,null,"〇","〇",null,"〇",null,null,"〇","〇","②",null,"有","〇","〇",null,"〇",null,null,"〇","有","〇","〇"]
[null,null,"松元　照哉",null,"〇","〇","①",null,null,"〇","〇",null,"〇","〇","①",null,null,null,"〇","〇",null,"〇","〇","〇",null,null,"〇",null,"〇",null,"〇","〇","〇"]
[null,null,"斉藤　京子","〇","②","―","―","公","〇","公","〇","―","―","公","公","〇","〇","―","―","公","②","公","〇","公","公","〇","有","〇","①","〇","〇","公","公","①"]
[null,null,"角　　 智美","〇","公","①","公","〇","―","―","公","〇","②","―","―","公","①","有","公","〇","―","―","公","〇","〇","―","―","公","公","公","②","―","―","公"]
[null,null,"古賀　美奈子","公","公","②","―","―","公","〇","公","①","―","―","公","②","―","―","有","公","公","〇","〇","―","―","公","①","―","―","公","公","①","〇","―"]
[null,null,"後藤　徹矢","公","―","―","公","公","公","〇","②","―","―","公","②","―","―","公","〇","①","〇","―","―","公","〇","〇","〇","公","〇","②","―","―","公","公"]
[null,null,"瀬戸口　真紀","〇","〇","公","公","〇","〇","〇","〇","〇","公","公","〇","〇","〇","〇","公","公","公","〇","〇","〇","〇","〇","公","公","〇","〇","〇","公","〇","〇"]
[null,null,"井出　八千代",null,"◑","◑","◑",null,"◑","◑",null,null,null,"◑",null,"◑","◑",null,"◑","◑",null,"◑",null,"◑",null,"有","◑",null,"◑","◑","◑",null,"◑"]
[null,null,"斉藤　洋子","〇","①","公","〇","〇","公","〇","公","〇","①","〇","公","〇","公","〇","〇","公","〇","①","〇","〇","公","〇","〇","〇","公","〇","公","公","〇","〇"]
[null,null,"友池　淳子",null,null,null,null,null,null,null,null,null,null,null,null,null,null,null,"〇","公","公","〇","〇","〇","〇","公","公","公","〇","公","〇","〇","①","〇"]
[null,null,"白水　恵美子","公","公","〇","―","―","公","〇","―","―","公","―","―","公","②","―","―","公","有","有","―","―","公","②","公","―","―","公","〇","―","―","公"]
[null,null,"赤松　修","①","公","―","―","公","②","―","―","公","有","公","―","―","公","〇","公","―","―","公","②","―","―","公","〇","〇","―","―","公","②","公","―"]
[null,null,"林　　 恵理","公","―","―","公","公","―","―","公","②","―","―","公","①","―","―","公","〇","〇","―","―","公","①","有","―","―","公","公","―","―","公","〇"]
[null,null,"友池　明日香","―","―","公","公","―","―","公","①","―","―","公","〇","―","―","公","①","〇","―","―","公","〇","〇","公","―","公","〇","―","―","公","公","②"]
[null,null,"日高 幸江","〇","〇","公","〇","〇","公","〇","〇","〇","公","公","〇","〇","〇","公","〇","〇","公","〇","〇","公","〇","〇","公","〇","〇","公","〇","〇","〇","公"]
[null,null,"（平日10:00～18:30）（土・日・祝8:45～17:15）"]
[null,null,"野田　哲子","公","〇","〇","公","①","〇","〇","公","公","〇","〇","有","公","〇","①","―","―","公","〇","公","〇","―","―","公","公","②","〇","①","公","―","―"]
[null,null,"内田　加奈江","〇","〇",null,null,"〇","〇",null,"〇","〇",null,null,"〇",null,"〇","〇","〇",null,null,"〇","〇",null,"〇","〇",null,null,null,"〇","〇","〇","〇"]
[null,null,"9:00～13:00"]
[null,null,"鎌田　幸一","有","〇","公","公","〇","〇","〇","公","〇","公","〇","公","有","〇","〇","〇","公","有","〇","〇","〇","公","〇","公","〇","公","〇","〇","公","〇","〇"]
[null,null,"宮元　優子","〇","公","〇","〇","〇","公","〇","〇","公","〇","公","〇","〇","〇","公","公","〇","〇","〇","公","〇","〇","〇","〇","公","〇","公","〇","〇","〇","公"]
[null,null,"谷口　篤志","〇",null,null,null,"〇",null,"〇","〇","〇",null,null,"〇","〇","〇","〇",null,null,null,"〇",null,"〇","〇","〇",null,null,"〇","〇","〇","〇"]

{"sheet":"夜勤データ","index":2,"n_rows":961,"n_cols":15,"rows_kept":961,"cut":false,"hidden":false,"merged":[]}
[null,null,null,null,"勤務表",null,null,null,null,null,"医師勤務表等"]
[null,"年","月","日","NS","私","CW","ON","ON","第1/2","DR","科","外線","備考","表示"]
[null,1,1,1,"test",null,"test"]
[null,1,1,1,"test",null,"test"]
[null,1,1,1,"test",null,"test"]
[null,2020,7,31,"サンプル　","A","ここの行を消したらエラーでます　",null,null,null,null,null,null,null,{"$f":"IF(ISERROR(LEFT(E6,FIND(\"　\",E6,1)-1)&F6&\" \"&LEFT(G6,FIND(\"　\",G6,1)-1)&\" \"&K6&L6&\" \"&H6&IF(I6<>\"\",\"or\"&I6,\"\")&J6&M6&N6), \"\", LEFT(E6,FIND(\"　\",E6,1)-1)&F6&\" \"&LEFT(G6,FIND(\"　\",G6,1)-1)&\" \"&K6&L6&\" \"&H6&IF(I6<>\"\",\"or\"&I6,\"\")&J6&M6&N6)","v":"サンプルA ここの行を消したらエラーでます  "}]
[null,2020,{"$f":"IF(D7=\"\",\"\",IF(D7<D6,IF(1+INDEX(C:C,MATCH(MAX(C$1:C6)+1,C$1:C6, 1))>12,1,1+INDEX(C:C,MATCH(MAX(C$1:C6)+1,C$1:C6, 1))),\"\"))","v":8},3,"松木　直美","B","松木　直美",null,null,null,"石井","(精)",null,null,"松木B 松木 石井(精) "]
[null,{"$f":"IF(C8<>1,\"\",1+INDEX(B:B,MATCH(MAX(B$1:B7)+1,B$1:B7, 1)))","v":""},{"$f":"IF(D8=\"\",\"\",IF(D8<D7,IF(1+INDEX(C:C,MATCH(MAX(C$1:C7)+1,C$1:C7, 1))>12,1,1+INDEX(C:C,MATCH(MAX(C$1:C7)+1,C$1:C7, 1))),\"\"))","v":""},7,"浅香　茂","A","加藤　裕子","小幡Dr（サブ）",null,null,"村山","(精)",null,null,"浅香A 加藤 村山(精) 小幡Dr（サブ）"]
[null,{"$f":"IF(C9<>1,\"\",1+INDEX(B:B,MATCH(MAX(B$1:B8)+1,B$1:B8, 1)))","v":""},{"$f":"IF(D9=\"\",\"\",IF(D9<D8,IF(1+INDEX(C:C,MATCH(MAX(C$1:C8)+1,C$1:C8, 1))>12,1,1+INDEX(C:C,MATCH(MAX(C$1:C8)+1,C$1:C8, 1))),\"\"))","v":""},13,"浅香　茂",{"$f":"IF(E9=\"\",\"\",IF(COUNTIF(E$6:E8,E9)<1,\"初\",IFERROR(VLOOKUP(INDEX(F$1:F8,_xlfn.AGGREGATE(14,6,ROW(E$6:E8)/(E$6:E8=E9),1)),{\"A\",\"B\";\"B\",\"A\"},2,0),\"\")))","v":"B"},"加藤　裕子","松岡",null,null,"江川","(精)","【外線】",null,"浅香B 加藤 江川(精) 松岡【外線】"]
[null,{"$f":"IF(C10<>1,\"\",1+INDEX(B:B,MATCH(MAX(B$1:B9)+1,B$1:B9, 1)))","v":""},{"$f":"IF(D10=\"\",\"\",IF(D10<D9,IF(1+INDEX(C:C,MATCH(MAX(C$1:C9)+1,C$1:C9, 1))>12,1,1+INDEX(C:C,MATCH(MAX(C$1:C9)+1,C$1:C9, 1))),\"\"))","v":""},17,"江上　雄也","B","高田　あづみ",null,null,null,"石井","(精)",null,null,"江上B 高田 石井(精) "]
[null,{"$f":"IF(C11<>1,\"\",1+INDEX(B:B,MATCH(MAX(B$1:B10)+1,B$1:B10, 1)))","v":""},{"$f":"IF(D11=\"\",\"\",IF(D11<D10,IF(1+INDEX(C:C,MATCH(MAX(C$1:C10)+1,C$1:C10, 1))>12,1,1+INDEX(C:C,MATCH(MAX(C$1:C10)+1,C$1:C10, 1))),\"\"))","v":""},24,"濱田　真理子","B","加藤　裕子",null,null,null,"石井","(精)","【外線】",null,"濱田B 加藤 石井(精) 【外線】"]
[null,{"$f":"IF(C12<>1,\"\",1+INDEX(B:B,MATCH(MAX(B$1:B11)+1,B$1:B11, 1)))","v":""},{"$f":"IF(D12=\"\",\"\",IF(D12<D11,IF(1+INDEX(C:C,MATCH(MAX(C$1:C11)+1,C$1:C11, 1))>12,1,1+INDEX(C:C,MATCH(MAX(C$1:C11)+1,C$1:C11, 1))),\"\"))","v":9},9,"矢橋　律子","A","加藤　裕子",null,null,null,"畑部","(精)","【外線】",null,"矢橋A 加藤 畑部(精) 【外線】"]
[null,{"$f":"IF(C13<>1,\"\",1+INDEX(B:B,MATCH(MAX(B$1:B12)+1,B$1:B12, 1)))","v":""},{"$f":"IF(D13=\"\",\"\",IF(D13<D12,IF(1+INDEX(C:C,MATCH(MAX(C$1:C12)+1,C$1:C12, 1))>12,1,1+INDEX(C:C,MATCH(MAX(C$1:C12)+1,C$1:C12, 1))),\"\"))","v":""},15,"浅香　茂",{"$f":"IF(E13=\"\",\"\",IF(COUNTIF(E$6:E12,E13)<1,\"初\",IFERROR(VLOOKUP(INDEX(F$1:F12,_xlfn.AGGREGATE(14,6,ROW(E$6:E12)/(E$6:E12=E13),1)),{\"A\",\"B\";\"B\",\"A\"},2,0),\"\")))","v":"A"},"布谷　衣代",null,null,null,"竹田","(精)",null,null,"浅香A 布谷 竹田(精) "]
[null,{"$f":"IF(C14<>1,\"\",1+INDEX(B:B,MATCH(MAX(B$1:B13)+1,B$1:B13, 1)))","v":""},{"$f":"IF(D14=\"\",\"\",IF(D14<D13,IF(1+INDEX(C:C,MATCH(MAX(C$1:C13)+1,C$1:C13, 1))>12,1,1+INDEX(C:C,MATCH(MAX(C$1:C13)+1,C$1:C13, 1))),\"\"))","v":""},22,"矢橋　律子",{"$f":"IF(E14=\"\",\"\",IF(COUNTIF(E$6:E13,E14)<1,\"初\",IFERROR(VLOOKUP(INDEX(F$1:F13,_xlfn.AGGREGATE(14,6,ROW(E$6:E13)/(E$6:E13=E14),1)),{\"A\",\"B\";\"B\",\"A\"},2,0),\"\")))","v":"B"},"布谷　衣代",null,null,"《第1》","竹田","(精)","【外線】",null,"矢橋B 布谷 竹田(精) 《第1》【外線】"]
[null,{"$f":"IF(C15<>1,\"\",1+INDEX(B:B,MATCH(MAX(B$1:B14)+1,B$1:B14, 1)))","v":""},{"$f":"IF(D15=\"\",\"\",IF(D15<D14,IF(1+INDEX(C:C,MATCH(MAX(C$1:C14)+1,C$1:C14, 1))>12,1,1+INDEX(C:C,MATCH(MAX(C$1:C14)+1,C$1:C14, 1))),\"\"))","v":""},29,"元山　綾子","B","布谷　衣代",null,null,null,"竹田",null,null,null,"元山B 布谷 竹田 "]
[null,{"$f":"IF(C16<>1,\"\",1+INDEX(B:B,MATCH(MAX(B$1:B15)+1,B$1:B15, 1)))","v":""},{"$f":"IF(D16=\"\",\"\",IF(D16<D15,IF(1+INDEX(C:C,MATCH(MAX(C$1:C15)+1,C$1:C15, 1))>12,1,1+INDEX(C:C,MATCH(MAX(C$1:C15)+1,C$1:C15, 1))),\"\"))","v":10},5,"濱田　真理子","B","原田　桂衣",null,null,null,"石井","(精)","【外線】",null,"濱田B 原田 石井(精) 【外線】"]
[null,{"$f":"IF(C17<>1,\"\",1+INDEX(B:B,MATCH(MAX(B$1:B16)+1,B$1:B16, 1)))","v":""},{"$f":"IF(D17=\"\",\"\",IF(D17<D16,IF(1+INDEX(C:C,MATCH(MAX(C$1:C16)+1,C$1:C16, 1))>12,1,1+INDEX(C:C,MATCH(MAX(C$1:C16)+1,C$1:C16, 1))),\"\"))","v":""},10,"田中　公英","B","高田　あづみ","院長","松岡（サブ）","《第2》","井上","(外)","【外線】",null,"田中B 高田 井上(外) 院長or松岡（サブ）《第2》【外線】"]
[null,{"$f":"IF(C18<>1,\"\",1+INDEX(B:B,MATCH(MAX(B$1:B17)+1,B$1:B17, 1)))","v":""},{"$f":"IF(D18=\"\",\"\",IF(D18<D17,IF(1+INDEX(C:C,MATCH(MAX(C$1:C17)+1,C$1:C17, 1))>12,1,1+INDEX(C:C,MATCH(MAX(C$1:C17)+1,C$1:C17, 1))),\"\"))","v":""},15,"鈴木　遥","B","原田　桂衣","末永","院長",null,"浪花","(精)",null,null,"鈴木B 原田 浪花(精) 末永or院長"]
[null,{"$f":"IF(C19<>1,\"\",1+INDEX(B:B,MATCH(MAX(B$1:B18)+1,B$1:B18, 1)))","v":""},{"$f":"IF(D19=\"\",\"\",IF(D19<D18,IF(1+INDEX(C:C,MATCH(MAX(C$1:C18)+1,C$1:C18, 1))>12,1,1+INDEX(C:C,MATCH(MAX(C$1:C18)+1,C$1:C18, 1))),\"\"))","v":""},20,"浅香　茂",{"$f":"IF(E19=\"\",\"\",IF(COUNTIF(E$6:E18,E19)<1,\"初\",IFERROR(VLOOKUP(INDEX(F$1:F18,_xlfn.AGGREGATE(14,6,ROW(E$6:E18)/(E$6:E18=E19),1)),{\"A\",\"B\";\"B\",\"A\"},2,0),\"\")))","v":"B"},"友池　淳子",null,null,null,"竹田","(精)","【外線】",null,"浅香B 友池 竹田(精) 【外線】"]
[null,{"$f":"IF(C20<>1,\"\",1+INDEX(B:B,MATCH(MAX(B$1:B19)+1,B$1:B19, 1)))","v":""},{"$f":"IF(D20=\"\",\"\",IF(D20<D19,IF(1+INDEX(C:C,MATCH(MAX(C$1:C19)+1,C$1:C19, 1))>12,1,1+INDEX(C:C,MATCH(MAX(C$1:C19)+1,C$1:C19, 1))),\"\"))","v":""},24,"金久　三和子","B","高田　あづみ","末永","院長（サブ）",null,"田中","(内)","【外線】",null,"金久B 高田 田中(内) 末永or院長（サブ）【外線】"]
[null,{"$f":"IF(C21<>1,\"\",1+INDEX(B:B,MATCH(MAX(B$1:B20)+1,B$1:B20, 1)))","v":""},{"$f":"IF(D21=\"\",\"\",IF(D21<D20,IF(1+INDEX(C:C,MATCH(MAX(C$1:C20)+1,C$1:C20, 1))>12,1,1+INDEX(C:C,MATCH(MAX(C$1:C20)+1,C$1:C20, 1))),\"\"))","v":""},31,"江上　雄也",{"$f":"IF(E21=\"\",\"\",IF(COUNTIF(E$6:E20,E21)<1,\"初\",IFERROR(VLOOKUP(INDEX(F$1:F20,_xlfn.AGGREGATE(14,6,ROW(E$6:E20)/(E$6:E20=E21),1)),{\"A\",\"B\";\"B\",\"A\"},2,0),\"\")))","v":"A"},"原田　桂衣","院長",null,null,"井上","(外)",null,null,"江上A 原田 井上(外) 院長"]
[null,{"$f":"IF(C22<>1,\"\",1+INDEX(B:B,MATCH(MAX(B$1:B21)+1,B$1:B21, 1)))","v":""},{"$f":"IF(D22=\"\",\"\",IF(D22<D21,IF(1+INDEX(C:C,MATCH(MAX(C$1:C21)+1,C$1:C21, 1))>12,1,1+INDEX(C:C,MATCH(MAX(C$1:C21)+1,C$1:C21, 1))),\"\"))","v":11},13,"濱田　真理子",{"$f":"IF(E22=\"\",\"\",IF(COUNTIF(E$6:E21,E22)<1,\"初\",IFERROR(VLOOKUP(INDEX(F$1:F21,_xlfn.AGGREGATE(14,6,ROW(E$6:E21)/(E$6:E21=E22),1)),{\"A\",\"B\";\"B\",\"A\"},2,0),\"\")))","v":"A"},"原田　桂衣","小幡Dr",null,null,"村山","(精)",null,null,"濱田A 原田 村山(精) 小幡Dr"]
[null,{"$f":"IF(C23<>1,\"\",1+INDEX(B:B,MATCH(MAX(B$1:B22)+1,B$1:B22, 1)))","v":""},{"$f":"IF(D23=\"\",\"\",IF(D23<D22,IF(1+INDEX(C:C,MATCH(MAX(C$1:C22)+1,C$1:C22, 1))>12,1,1+INDEX(C:C,MATCH(MAX(C$1:C22)+1,C$1:C22, 1))),\"\"))","v":""},17,"福地　洋樹","B","布谷　衣代",null,null,null,"竹田","(精)","【外線】",null,"福地B 布谷 竹田(精) 【外線】"]
[null,{"$f":"IF(C24<>1,\"\",1+INDEX(B:B,MATCH(MAX(B$1:B23)+1,B$1:B23, 1)))","v":""},{"$f":"IF(D24=\"\",\"\",IF(D24<D23,IF(1+INDEX(C:C,MATCH(MAX(C$1:C23)+1,C$1:C23, 1))>12,1,1+INDEX(C:C,MATCH(MAX(C$1:C23)+1,C$1:C23, 1))),\"\"))","v":""},22,"浅香　茂",{"$f":"IF(E24=\"\",\"\",IF(COUNTIF(E$6:E23,E24)<1,\"初\",IFERROR(VLOOKUP(INDEX(F$1:F23,_xlfn.AGGREGATE(14,6,ROW(E$6:E23)/(E$6:E23=E24),1)),{\"A\",\"B\";\"B\",\"A\"},2,0),\"\")))","v":"A"},"高田　あづみ","松岡",null,null,"本山",null,"【外線】",null,"浅香A 高田 本山 松岡【外線】"]
[null,{"$f":"IF(C25<>1,\"\",1+INDEX(B:B,MATCH(MAX(B$1:B24)+1,B$1:B24, 1)))","v":""},{"$f":"IF(D25=\"\",\"\",IF(D25<D24,IF(1+INDEX(C:C,MATCH(MAX(C$1:C24)+1,C$1:C24, 1))>12,1,1+INDEX(C:C,MATCH(MAX(C$1:C24)+1,C$1:C24, 1))),\"\"))","v":""},28,"松木　直美",{"$f":"IF(E25=\"\",\"\",IF(COUNTIF(E$6:E24,E25)<1,\"初\",IFERROR(VLOOKUP(INDEX(F$1:F24,_xlfn.AGGREGATE(14,6,ROW(E$6:E24)/(E$6:E24=E25),1)),{\"A\",\"B\";\"B\",\"A\"},2,0),\"\")))","v":"A"},"高田　あづみ","末永",null,null,"田中",null,null,null,"松木A 高田 田中 末永"]
[null,{"$f":"IF(C26<>1,\"\",1+INDEX(B:B,MATCH(MAX(B$1:B25)+1,B$1:B25, 1)))","v":""},{"$f":"IF(D26=\"\",\"\",IF(D26<D25,IF(1+INDEX(C:C,MATCH(MAX(C$1:C25)+1,C$1:C25, 1))>12,1,1+INDEX(C:C,MATCH(MAX(C$1:C25)+1,C$1:C25, 1))),\"\"))","v":12},6,"播磨　貴代美","　","松尾　美佐子",null,null,null,null,null,null,null,{"$f":"IF(ISERROR(LEFT(E26,FIND(\"　\",E26,1)-1)&\" \"&LEFT(G26,FIND(\"　\",G26,1)-1)&\" \"&K26&L26&\" \"&H26&IF(I26<>\"\",\"or\"&I26,\"\")&J26&M26&N26), \"\", LEFT(E26,FIND(\"　\",E26,1)-1)&\" \"&LEFT(G26,FIND(\"　\",G26,1)-1)&\" \"&K26&L26&\" \"&H26&IF(I26<>\"\",\"or\"&I26,\"\")&J26&M26&N26)&\" \"&F26","v":"播磨 松尾   　"}]
[null,{"$f":"IF(C27<>1,\"\",1+INDEX(B:B,MATCH(MAX(B$1:B26)+1,B$1:B26, 1)))","v":""},{"$f":"IF(D27=\"\",\"\",IF(D27<D26,IF(1+INDEX(C:C,MATCH(MAX(C$1:C26)+1,C$1:C26, 1))>12,1,1+INDEX(C:C,MATCH(MAX(C$1:C26)+1,C$1:C26, 1))),\"\"))","v":""},13,"柴田　由美","　","松尾　美佐子",null,null,null,null,null,null,null,{"$f":"IF(ISERROR(LEFT(E27,FIND(\"　\",E27,1)-1)&\" \"&LEFT(G27,FIND(\"　\",G27,1)-1)&\" \"&K27&L27&\" \"&H27&IF(I27<>\"\",\"or\"&I27,\"\")&J27&M27&N27), \"\", LEFT(E27,FIND(\"　\",E27,1)-1)&\" \"&LEFT(G27,FIND(\"　\",G27,1)-1)&\" \"&K27&L27&\" \"&H27&IF(I27<>\"\",\"or\"&I27,\"\")&J27&M27&N27)&\" \"&F27","v":"柴田 松尾   　"}]
[null,{"$f":"IF(C28<>1,\"\",1+INDEX(B:B,MATCH(MAX(B$1:B27)+1,B$1:B27, 1)))","v":""},{"$f":"IF(D28=\"\",\"\",IF(D28<D27,IF(1+INDEX(C:C,MATCH(MAX(C$1:C27)+1,C$1:C27, 1))>12,1,1+INDEX(C:C,MATCH(MAX(C$1:C27)+1,C$1:C27, 1))),\"\"))","v":""},17,"播磨　貴代美",{"$f":"IF(E28=\"\",\"\",IF(COUNTIF(E$6:E27,E28)<1,\"初\",IFERROR(VLOOKUP(INDEX(F$1:F27,_xlfn.AGGREGATE(14,6,ROW(E$6:E27)/(E$6:E27=E28),1)),{\"申\",\"　\";\"　\",\"申\"},2,0),\"\")))","v":"申"},"松尾　美佐子",null,null,null,null,null,null,null,{"$f":"IF(ISERROR(LEFT(E28,FIND(\"　\",E28,1)-1)&\" \"&LEFT(G28,FIND(\"　\",G28,1)-1)&\" \"&K28&L28&\" \"&H28&IF(I28<>\"\",\"or\"&I28,\"\")&J28&M28&N28), \"\", LEFT(E28,FIND(\"　\",E28,1)-1)&\" \"&LEFT(G28,FIND(\"　\",G28,1)-1)&\" \"&K28&L28&\" \"&H28&IF(I28<>\"\",\"or\"&I28,\"\")&J28&M28&N28)&\" \"&F28","v":"播磨 松尾   申"}]
[null,{"$f":"IF(C29<>1,\"\",1+INDEX(B:B,MATCH(MAX(B$1:B28)+1,B$1:B28, 1)))","v":""},{"$f":"IF(D29=\"\",\"\",IF(D29<D28,IF(1+INDEX(C:C,MATCH(MAX(C$1:C28)+1,C$1:C28, 1))>12,1,1+INDEX(C:C,MATCH(MAX(C$1:C28)+1,C$1:C28, 1))),\"\"))","v":""},22,"斉藤　京子","申","中川　喜之",null,null,null,null,null,null,null,{"$f":"IF(ISERROR(LEFT(E29,FIND(\"　\",E29,1)-1)&\" \"&LEFT(G29,FIND(\"　\",G29,1)-1)&\" \"&K29&L29&\" \"&H29&IF(I29<>\"\",\"or\"&I29,\"\")&J29&M29&N29), \"\", LEFT(E29,FIND(\"　\",E29,1)-1)&\" \"&LEFT(G29,FIND(\"　\",G29,1)-1)&\" \"&K29&L29&\" \"&H29&IF(I29<>\"\",\"or\"&I29,\"\")&J29&M29&N29)&\" \"&F29","v":"斉藤 中川   申"}]
[null,{"$f":"IF(C30<>1,\"\",1+INDEX(B:B,MATCH(MAX(B$1:B29)+1,B$1:B29, 1)))","v":""},{"$f":"IF(D30=\"\",\"\",IF(D30<D29,IF(1+INDEX(C:C,MATCH(MAX(C$1:C29)+1,C$1:C29, 1))>12,1,1+INDEX(C:C,MATCH(MAX(C$1:C29)+1,C$1:C29, 1))),\"\"))","v":""},28,"柴田　由美",{"$f":"IF(E30=\"\",\"\",IF(COUNTIF(E$6:E29,E30)<1,\"初\",IFERROR(VLOOKUP(INDEX(F$1:F29,_xlfn.AGGREGATE(14,6,ROW(E$6:E29)/(E$6:E29=E30),1)),{\"申\",\"　\";\"　\",\"申\"},2,0),\"\")))","v":"申"},"3B　",null,null,null,null,null,null,null,{"$f":"IF(ISERROR(LEFT(E30,FIND(\"　\",E30,1)-1)&\" \"&LEFT(G30,FIND(\"　\",G30,1)-1)&\" \"&K30&L30&\" \"&H30&IF(I30<>\"\",\"or\"&I30,\"\")&J30&M30&N30), \"\", LEFT(E30,FIND(\"　\",E30,1)-1)&\" \"&LEFT(G30,FIND(\"　\",G30,1)-1)&\" \"&K30&L30&\" \"&H30&IF(I30<>\"\",\"or\"&I30,\"\")&J30&M30&N30)&\" \"&F30","v":"柴田 3B   申"}]
[null,{"$f":"IF(C31<>1,\"\",1+INDEX(B:B,MATCH(MAX(B$1:B30)+1,B$1:B30, 1)))","v":2021},{"$f":"IF(D31=\"\",\"\",IF(D31<D30,IF(1+INDEX(C:C,MATCH(MAX(C$1:C30)+1,C$1:C30, 1))>12,1,1+INDEX(C:C,MATCH(MAX(C$1:C30)+1,C$1:C30, 1))),\"\"))","v":1},3,"高木　曜","　","西嶋　拓哉",null,null,null,null,null,null,null,{"$f":"IF(ISERROR(LEFT(E31,FIND(\"　\",E31,1)-1)&\" \"&LEFT(G31,FIND(\"　\",G31,1)-1)&\" \"&K31&L31&\" \"&H31&IF(I31<>\"\",\"or\"&I31,\"\")&J31&M31&N31), \"\", LEFT(E31,FIND(\"　\",E31,1)-1)&\" \"&LEFT(G31,FIND(\"　\",G31,1)-1)&\" \"&K31&L31&\" \"&H31&IF(I31<>\"\",\"or\"&I31,\"\")&J31&M31&N31)&\" \"&F31","v":"高木 西嶋   　"}]
[null,{"$f":"IF(C32<>1,\"\",1+INDEX(B:B,MATCH(MAX(B$1:B31)+1,B$1:B31, 1)))","v":""},{"$f":"IF(D32=\"\",\"\",IF(D32<D31,IF(1+INDEX(C:C,MATCH(MAX(C$1:C31)+1,C$1:C31, 1))>12,1,1+INDEX(C:C,MATCH(MAX(C$1:C31)+1,C$1:C31, 1))),\"\"))","v":""},8,"藤崎　登美江","申","3B　",null,null,null,null,null,null,null,"藤崎 3B   申"]
[null,{"$f":"IF(C33<>1,\"\",1+INDEX(B:B,MATCH(MAX(B$1:B32)+1,B$1:B32, 1)))","v":""},{"$f":"IF(D33=\"\",\"\",IF(D33<D32,IF(1+INDEX(C:C,MATCH(MAX(C$1:C32)+1,C$1:C32, 1))>12,1,1+INDEX(C:C,MATCH(MAX(C$1:C32)+1,C$1:C32, 1))),\"\"))","v":""},17,"松永　健","　","白水　恵美子",null,null,null,null,null,null,null,"松永 白水   　"]
[null,{"$f":"IF(C34<>1,\"\",1+INDEX(B:B,MATCH(MAX(B$1:B33)+1,B$1:B33, 1)))","v":""},{"$f":"IF(D34=\"\",\"\",IF(D34<D33,IF(1+INDEX(C:C,MATCH(MAX(C$1:C33)+1,C$1:C33, 1))>12,1,1+INDEX(C:C,MATCH(MAX(C$1:C33)+1,C$1:C33, 1))),\"\"))","v":""},21,"播磨　貴代美",{"$f":"IF(E34=\"\",\"\",IF(COUNTIF(E$6:E33,E34)<1,\"初\",IFERROR(VLOOKUP(INDEX(F$1:F33,_xlfn.AGGREGATE(14,6,ROW(E$6:E33)/(E$6:E33=E34),1)),{\"申\",\"　\";\"　\",\"申\"},2,0),\"\")))","v":"　"},"3B　",null,null,null,null,null,null,null,"播磨 3B   　"]
[null,{"$f":"IF(C35<>1,\"\",1+INDEX(B:B,MATCH(MAX(B$1:B34)+1,B$1:B34, 1)))","v":""},{"$f":"IF(D35=\"\",\"\",IF(D35<D34,IF(1+INDEX(C:C,MATCH(MAX(C$1:C34)+1,C$1:C34, 1))>12,1,1+INDEX(C:C,MATCH(MAX(C$1:C34)+1,C$1:C34, 1))),\"\"))","v":""},26,"川村　栄子","申","白水　恵美子",null,null,null,null,null,null,null,"川村 白水   申"]
[null,{"$f":"IF(C36<>1,\"\",1+INDEX(B:B,MATCH(MAX(B$1:B35)+1,B$1:B35, 1)))","v":""},{"$f":"IF(D36=\"\",\"\",IF(D36<D35,IF(1+INDEX(C:C,MATCH(MAX(C$1:C35)+1,C$1:C35, 1))>12,1,1+INDEX(C:C,MATCH(MAX(C$1:C35)+1,C$1:C35, 1))),\"\"))","v":2},2,"斉藤　京子",{"$f":"IF(E36=\"\",\"\",IF(COUNTIF(E$6:E35,E36)<1,\"初\",IFERROR(VLOOKUP(INDEX(F$1:F35,_xlfn.AGGREGATE(14,6,ROW(E$6:E35)/(E$6:E35=E36),1)),{\"申\",\"　\";\"　\",\"申\"},2,0),\"\")))","v":"　"},"西嶋　拓哉",null,null,null,null,null,null,null,"斉藤 西嶋   　"]
[null,{"$f":"IF(C37<>1,\"\",1+INDEX(B:B,MATCH(MAX(B$1:B36)+1,B$1:B36, 1)))","v":""},{"$f":"IF(D37=\"\",\"\",IF(D37<D36,IF(1+INDEX(C:C,MATCH(MAX(C$1:C36)+1,C$1:C36, 1))>12,1,1+INDEX(C:C,MATCH(MAX(C$1:C36)+1,C$1:C36, 1))),\"\"))","v":""},8,"角　智美","申","奥　幸子",null,null,null,null,null,null,null,"角 奥   申"]
[null,{"$f":"IF(C38<>1,\"\",1+INDEX(B:B,MATCH(MAX(B$1:B37)+1,B$1:B37, 1)))","v":""},{"$f":"IF(D38=\"\",\"\",IF(D38<D37,IF(1+INDEX(C:C,MATCH(MAX(C$1:C37)+1,C$1:C37, 1))>12,1,1+INDEX(C:C,MATCH(MAX(C$1:C37)+1,C$1:C37, 1))),\"\"))","v":""},13,"高木　曜",{"$f":"IF(E38=\"\",\"\",IF(COUNTIF(E$6:E37,E38)<1,\"初\",IFERROR(VLOOKUP(INDEX(F$1:F37,_xlfn.AGGREGATE(14,6,ROW(E$6:E37)/(E$6:E37=E38),1)),{\"申\",\"　\";\"　\",\"申\"},2,0),\"\")))","v":"申"},"中川　喜之",null,null,null,null,null,null,null,"高木 中川   申"]
[null,{"$f":"IF(C39<>1,\"\",1+INDEX(B:B,MATCH(MAX(B$1:B38)+1,B$1:B38, 1)))","v":""},{"$f":"IF(D39=\"\",\"\",IF(D39<D38,IF(1+INDEX(C:C,MATCH(MAX(C$1:C38)+1,C$1:C38, 1))>12,1,1+INDEX(C:C,MATCH(MAX(C$1:C38)+1,C$1:C38, 1))),\"\"))","v":""},18,"斉藤　京子",{"$f":"IF(E39=\"\",\"\",IF(COUNTIF(E$6:E38,E39)<1,\"初\",IFERROR(VLOOKUP(INDEX(F$1:F38,_xlfn.AGGREGATE(14,6,ROW(E$6:E38)/(E$6:E38=E39),1)),{\"申\",\"　\";\"　\",\"申\"},2,0),\"\")))","v":"申"},"白水　恵美子",null,null,null,null,null,null,null,"斉藤 白水   申"]
[null,{"$f":"IF(C40<>1,\"\",1+INDEX(B:B,MATCH(MAX(B$1:B39)+1,B$1:B39, 1)))","v":""},{"$f":"IF(D40=\"\",\"\",IF(D40<D39,IF(1+INDEX(C:C,MATCH(MAX(C$1:C39)+1,C$1:C39, 1))>12,1,1+INDEX(C:C,MATCH(MAX(C$1:C39)+1,C$1:C39, 1))),\"\"))","v":""},22,"福田　美和子","申","奥　幸子",null,null,null,null,null,null,null,"福田 奥   申"]
[null,{"$f":"IF(C41<>1,\"\",1+INDEX(B:B,MATCH(MAX(B$1:B40)+1,B$1:B40, 1)))","v":""},{"$f":"IF(D41=\"\",\"\",IF(D41<D40,IF(1+INDEX(C:C,MATCH(MAX(C$1:C40)+1,C$1:C40, 1))>12,1,1+INDEX(C:C,MATCH(MAX(C$1:C40)+1,C$1:C40, 1))),\"\"))","v":3},1,"川村　栄子",{"$f":"IF(E41=\"\",\"\",IF(COUNTIF(E$6:E40,E41)<1,\"初\",IFERROR(VLOOKUP(INDEX(F$1:F40,_xlfn.AGGREGATE(14,6,ROW(E$6:E40)/(E$6:E40=E41),1)),{\"申\",\"　\";\"　\",\"申\"},2,0),\"\")))","v":"　"},"西嶋　拓哉",null,null,null,null,null,null,null,"川村 西嶋   　"]
[null,{"$f":"IF(C42<>1,\"\",1+INDEX(B:B,MATCH(MAX(B$1:B41)+1,B$1:B41, 1)))","v":""},{"$f":"IF(D42=\"\",\"\",IF(D42<D41,IF(1+INDEX(C:C,MATCH(MAX(C$1:C41)+1,C$1:C41, 1))>12,1,1+INDEX(C:C,MATCH(MAX(C$1:C41)+1,C$1:C41, 1))),\"\"))","v":""},9,"角　　 智美","申","西嶋　拓哉",null,null,null,null,null,null,null,"角 西嶋   申"]
[null,{"$f":"IF(C43<>1,\"\",1+INDEX(B:B,MATCH(MAX(B$1:B42)+1,B$1:B42, 1)))","v":""},{"$f":"IF(D43=\"\",\"\",IF(D43<D42,IF(1+INDEX(C:C,MATCH(MAX(C$1:C42)+1,C$1:C42, 1))>12,1,1+INDEX(C:C,MATCH(MAX(C$1:C42)+1,C$1:C42, 1))),\"\"))","v":""},17,"斉藤　京子",{"$f":"IF(E43=\"\",\"\",IF(COUNTIF(E$6:E42,E43)<1,\"初\",IFERROR(VLOOKUP(INDEX(F$1:F42,_xlfn.AGGREGATE(14,6,ROW(E$6:E42)/(E$6:E42=E43),1)),{\"申\",\"　\";\"　\",\"申\"},2,0),\"\")))","v":"　"},"３B　",null,null,null,null,null,null,null,{"$f":"IF(ISERROR(LEFT(E43,FIND(\"　\",E43,1)-1)&\" \"&LEFT(G43,FIND(\"　\",G43,1)-1)&\" \"&K43&L43&\" \"&H43&IF(I43<>\"\",\"or\"&I43,\"\")&J43&M43&N43), \"\", LEFT(E43,FIND(\"　\",E43,1)-1)&\" \"&LEFT(G43,FIND(\"　\",G43,1)-1)&\" \"&K43&L43&\" \"&H43&IF(I43<>\"\",\"or\"&I43,\"\")&J43&M43&N43)&\" \"&F43","v":"斉藤 ３B   　"}]
[null,{"$f":"IF(C44<>1,\"\",1+INDEX(B:B,MATCH(MAX(B$1:B43)+1,B$1:B43, 1)))","v":""},{"$f":"IF(D44=\"\",\"\",IF(D44<D43,IF(1+INDEX(C:C,MATCH(MAX(C$1:C43)+1,C$1:C43, 1))>12,1,1+INDEX(C:C,MATCH(MAX(C$1:C43)+1,C$1:C43, 1))),\"\"))","v":""},22,"林　　 和重","申","白水　恵美子",null,null,null,null,null,null,null,"林 白水   申"]
[null,{"$f":"IF(C45<>1,\"\",1+INDEX(B:B,MATCH(MAX(B$1:B44)+1,B$1:B44, 1)))","v":""},{"$f":"IF(D45=\"\",\"\",IF(D45<D44,IF(1+INDEX(C:C,MATCH(MAX(C$1:C44)+1,C$1:C44, 1))>12,1,1+INDEX(C:C,MATCH(MAX(C$1:C44)+1,C$1:C44, 1))),\"\"))","v":""},28,"福満　典子","申","松尾　美佐子",null,null,null,null,null,null,null,"福満 松尾   申"]
[null,{"$f":"IF(C46<>1,\"\",1+INDEX(B:B,MATCH(MAX(B$1:B45)+1,B$1:B45, 1)))","v":""},{"$f":"IF(D46=\"\",\"\",IF(D46<D45,IF(1+INDEX(C:C,MATCH(MAX(C$1:C45)+1,C$1:C45, 1))>12,1,1+INDEX(C:C,MATCH(MAX(C$1:C45)+1,C$1:C45, 1))),\"\"))","v":4},1,"斉藤　京子",{"$f":"IF(E46=\"\",\"\",IF(COUNTIF(E$6:E45,E46)<1,\"初\",IFERROR(VLOOKUP(INDEX(F$1:F45,_xlfn.AGGREGATE(14,6,ROW(E$6:E45)/(E$6:E45=E46),1)),{\"申\",\"　\";\"　\",\"申\"},2,0),\"\")))","v":"申"},"西川　仁美",null,null,null,null,null,null,null,"斉藤 西川   申"]
[null,{"$f":"IF(C47<>1,\"\",1+INDEX(B:B,MATCH(MAX(B$1:B46)+1,B$1:B46, 1)))","v":""},{"$f":"IF(D47=\"\",\"\",IF(D47<D46,IF(1+INDEX(C:C,MATCH(MAX(C$1:C46)+1,C$1:C46, 1))>12,1,1+INDEX(C:C,MATCH(MAX(C$1:C46)+1,C$1:C46, 1))),\"\"))","v":""},7,"播磨　貴代美",{"$f":"IF(E47=\"\",\"\",IF(COUNTIF(E$6:E46,E47)<1,\"初\",IFERROR(VLOOKUP(INDEX(F$1:F46,_xlfn.AGGREGATE(14,6,ROW(E$6:E46)/(E$6:E46=E47),1)),{\"申\",\"　\";\"　\",\"申\"},2,0),\"\")))","v":"申"},"白水　恵美子",null,null,null,null,null,null,null,"播磨 白水   申"]
[null,{"$f":"IF(C48<>1,\"\",1+INDEX(B:B,MATCH(MAX(B$1:B47)+1,B$1:B47, 1)))","v":""},{"$f":"IF(D48=\"\",\"\",IF(D48<D47,IF(1+INDEX(C:C,MATCH(MAX(C$1:C47)+1,C$1:C47, 1))>12,1,1+INDEX(C:C,MATCH(MAX(C$1:C47)+1,C$1:C47, 1))),\"\"))","v":""},16,"藤崎　登美江",{"$f":"IF(E48=\"\",\"\",IF(COUNTIF(E$6:E47,E48)<1,\"初\",IFERROR(VLOOKUP(INDEX(F$1:F47,_xlfn.AGGREGATE(14,6,ROW(E$6:E47)/(E$6:E47=E48),1)),{\"申\",\"　\";\"　\",\"申\"},2,0),\"\")))","v":"　"},"松尾　美佐子",null,null,null,null,null,null,null,"藤崎 松尾   　"]
[null,{"$f":"IF(C49<>1,\"\",1+INDEX(B:B,MATCH(MAX(B$1:B48)+1,B$1:B48, 1)))","v":""},{"$f":"IF(D49=\"\",\"\",IF(D49<D48,IF(1+INDEX(C:C,MATCH(MAX(C$1:C48)+1,C$1:C48, 1))>12,1,1+INDEX(C:C,MATCH(MAX(C$1:C48)+1,C$1:C48, 1))),\"\"))","v":""},21,"柴田　由美",{"$f":"IF(E49=\"\",\"\",IF(COUNTIF(E$6:E48,E49)<1,\"初\",IFERROR(VLOOKUP(INDEX(F$1:F48,_xlfn.AGGREGATE(14,6,ROW(E$6:E48)/(E$6:E48=E49),1)),{\"申\",\"　\";\"　\",\"申\"},2,0),\"\")))","v":"　"},"松尾　美佐子",null,null,null,null,null,null,null,"柴田 松尾   　"]
[null,{"$f":"IF(C50<>1,\"\",1+INDEX(B:B,MATCH(MAX(B$1:B49)+1,B$1:B49, 1)))","v":""},{"$f":"IF(D50=\"\",\"\",IF(D50<D49,IF(1+INDEX(C:C,MATCH(MAX(C$1:C49)+1,C$1:C49, 1))>12,1,1+INDEX(C:C,MATCH(MAX(C$1:C49)+1,C$1:C49, 1))),\"\"))","v":""},29,"高木　曜","　","鎌田　幸一",null,null,null,null,null,null,null,"高木 鎌田   　"]
[null,{"$f":"IF(C51<>1,\"\",1+INDEX(B:B,MATCH(MAX(B$1:B50)+1,B$1:B50, 1)))","v":""},{"$f":"IF(D51=\"\",\"\",IF(D51<D50,IF(1+INDEX(C:C,MATCH(MAX(C$1:C50)+1,C$1:C50, 1))>12,1,1+INDEX(C:C,MATCH(MAX(C$1:C50)+1,C$1:C50, 1))),\"\"))","v":5},8,"河野　理子","　","林　　 恵理",null,null,null,null,null,null,null,"河野 林   　"]
[null,{"$f":"IF(C52<>1,\"\",1+INDEX(B:B,MATCH(MAX(B$1:B51)+1,B$1:B51, 1)))","v":""},{"$f":"IF(D52=\"\",\"\",IF(D52<D51,IF(1+INDEX(C:C,MATCH(MAX(C$1:C51)+1,C$1:C51, 1))>12,1,1+INDEX(C:C,MATCH(MAX(C$1:C51)+1,C$1:C51, 1))),\"\"))","v":""},13,"高木　曜",{"$f":"IF(E52=\"\",\"\",IF(COUNTIF(E$6:E51,E52)<1,\"初\",IFERROR(VLOOKUP(INDEX(F$1:F51,_xlfn.AGGREGATE(14,6,ROW(E$6:E51)/(E$6:E51=E52),1)),{\"申\",\"　\";\"　\",\"申\"},2,0),\"\")))","v":"申"},"林　　 恵理",null,null,null,null,null,null,null,"高木 林   申"]
[null,{"$f":"IF(C53<>1,\"\",1+INDEX(B:B,MATCH(MAX(B$1:B52)+1,B$1:B52, 1)))","v":""},{"$f":"IF(D53=\"\",\"\",IF(D53<D52,IF(1+INDEX(C:C,MATCH(MAX(C$1:C52)+1,C$1:C52, 1))>12,1,1+INDEX(C:C,MATCH(MAX(C$1:C52)+1,C$1:C52, 1))),\"\"))","v":""},20,"高木　曜",{"$f":"IF(E53=\"\",\"\",IF(COUNTIF(E$6:E52,E53)<1,\"初\",IFERROR(VLOOKUP(INDEX(F$1:F52,_xlfn.AGGREGATE(14,6,ROW(E$6:E52)/(E$6:E52=E53),1)),{\"申\",\"　\";\"　\",\"申\"},2,0),\"\")))","v":"　"},"松尾　美佐子",null,null,null,null,null,null,null,"高木 松尾   　"]
[null,{"$f":"IF(C54<>1,\"\",1+INDEX(B:B,MATCH(MAX(B$1:B53)+1,B$1:B53, 1)))","v":""},{"$f":"IF(D54=\"\",\"\",IF(D54<D53,IF(1+INDEX(C:C,MATCH(MAX(C$1:C53)+1,C$1:C53, 1))>12,1,1+INDEX(C:C,MATCH(MAX(C$1:C53)+1,C$1:C53, 1))),\"\"))","v":""},28,"河野　理子",{"$f":"IF(E54=\"\",\"\",IF(COUNTIF(E$6:E53,E54)<1,\"初\",IFERROR(VLOOKUP(INDEX(F$1:F53,_xlfn.AGGREGATE(14,6,ROW(E$6:E53)/(E$6:E53=E54),1)),{\"申\",\"　\";\"　\",\"申\"},2,0),\"\")))","v":"申"},"白水　恵美子",null,null,null,null,null,null,null,"河野 白水   申"]
[null,{"$f":"IF(C55<>1,\"\",1+INDEX(B:B,MATCH(MAX(B$1:B54)+1,B$1:B54, 1)))","v":""},{"$f":"IF(D55=\"\",\"\",IF(D55<D54,IF(1+INDEX(C:C,MATCH(MAX(C$1:C54)+1,C$1:C54, 1))>12,1,1+INDEX(C:C,MATCH(MAX(C$1:C54)+1,C$1:C54, 1))),\"\"))","v":6},2,"福満　典子",{"$f":"IF(E55=\"\",\"\",IF(COUNTIF(E$6:E54,E55)<1,\"初\",IFERROR(VLOOKUP(INDEX(F$1:F54,_xlfn.AGGREGATE(14,6,ROW(E$6:E54)/(E$6:E54=E55),1)),{\"申\",\"　\";\"　\",\"申\"},2,0),\"\")))","v":"　"},"西川　仁美",null,null,null,null,null,null,null,"福満 西川   　"]
[null,{"$f":"IF(C56<>1,\"\",1+INDEX(B:B,MATCH(MAX(B$1:B55)+1,B$1:B55, 1)))","v":""},{"$f":"IF(D56=\"\",\"\",IF(D56<D55,IF(1+INDEX(C:C,MATCH(MAX(C$1:C55)+1,C$1:C55, 1))>12,1,1+INDEX(C:C,MATCH(MAX(C$1:C55)+1,C$1:C55, 1))),\"\"))","v":""},7,"柴田　由美",{"$f":"IF(E56=\"\",\"\",IF(COUNTIF(E$6:E55,E56)<1,\"初\",IFERROR(VLOOKUP(INDEX(F$1:F55,_xlfn.AGGREGATE(14,6,ROW(E$6:E55)/(E$6:E55=E56),1)),{\"申\",\"　\";\"　\",\"申\"},2,0),\"\")))","v":"申"},"３B　",null,null,null,null,null,null,null,"柴田 ３B   申"]
[null,{"$f":"IF(C57<>1,\"\",1+INDEX(B:B,MATCH(MAX(B$1:B56)+1,B$1:B56, 1)))","v":""},{"$f":"IF(D57=\"\",\"\",IF(D57<D56,IF(1+INDEX(C:C,MATCH(MAX(C$1:C56)+1,C$1:C56, 1))>12,1,1+INDEX(C:C,MATCH(MAX(C$1:C56)+1,C$1:C56, 1))),\"\"))","v":""},15,"藤崎　登美江",{"$f":"IF(E57=\"\",\"\",IF(COUNTIF(E$6:E56,E57)<1,\"初\",IFERROR(VLOOKUP(INDEX(F$1:F56,_xlfn.AGGREGATE(14,6,ROW(E$6:E56)/(E$6:E56=E57),1)),{\"申\",\"　\";\"　\",\"申\"},2,0),\"\")))","v":"申"},"鎌田　幸一",null,null,null,null,null,null,null,"藤崎 鎌田   申"]
[null,{"$f":"IF(C58<>1,\"\",1+INDEX(B:B,MATCH(MAX(B$1:B57)+1,B$1:B57, 1)))","v":""},{"$f":"IF(D58=\"\",\"\",IF(D58<D57,IF(1+INDEX(C:C,MATCH(MAX(C$1:C57)+1,C$1:C57, 1))>12,1,1+INDEX(C:C,MATCH(MAX(C$1:C57)+1,C$1:C57, 1))),\"\"))","v":""},23,"柴田　由美",{"$f":"IF(E58=\"\",\"\",IF(COUNTIF(E$6:E57,E58)<1,\"初\",IFERROR(VLOOKUP(INDEX(F$1:F57,_xlfn.AGGREGATE(14,6,ROW(E$6:E57)/(E$6:E57=E58),1)),{\"申\",\"　\";\"　\",\"申\"},2,0),\"\")))","v":"　"},"林　　 恵理",null,null,null,null,null,null,null,"柴田 林   　"]
[null,{"$f":"IF(C59<>1,\"\",1+INDEX(B:B,MATCH(MAX(B$1:B58)+1,B$1:B58, 1)))","v":""},{"$f":"IF(D59=\"\",\"\",IF(D59<D58,IF(1+INDEX(C:C,MATCH(MAX(C$1:C58)+1,C$1:C58, 1))>12,1,1+INDEX(C:C,MATCH(MAX(C$1:C58)+1,C$1:C58, 1))),\"\"))","v":7},5,"柴田　由美",{"$f":"IF(E59=\"\",\"\",IF(COUNTIF(E$6:E58,E59)<1,\"初\",IFERROR(VLOOKUP(INDEX(F$1:F58,_xlfn.AGGREGATE(14,6,ROW(E$6:E58)/(E$6:E58=E59),1)),{\"申\",\"　\";\"　\",\"申\"},2,0),\"\")))","v":"申"},"西川　仁美",null,null,null,null,null,null,null,"柴田 西川   申"]
[null,{"$f":"IF(C60<>1,\"\",1+INDEX(B:B,MATCH(MAX(B$1:B59)+1,B$1:B59, 1)))","v":""},{"$f":"IF(D60=\"\",\"\",IF(D60<D59,IF(1+INDEX(C:C,MATCH(MAX(C$1:C59)+1,C$1:C59, 1))>12,1,1+INDEX(C:C,MATCH(MAX(C$1:C59)+1,C$1:C59, 1))),\"\"))","v":""},11,"斉藤　京子",{"$f":"IF(E60=\"\",\"\",IF(COUNTIF(E$6:E59,E60)<1,\"初\",IFERROR(VLOOKUP(INDEX(F$1:F59,_xlfn.AGGREGATE(14,6,ROW(E$6:E59)/(E$6:E59=E60),1)),{\"申\",\"　\";\"　\",\"申\"},2,0),\"\")))","v":"　"},"斉藤　京子",null,null,null,null,null,null,null,"斉藤 斉藤   　"]
[null,{"$f":"IF(C61<>1,\"\",1+INDEX(B:B,MATCH(MAX(B$1:B60)+1,B$1:B60, 1)))","v":""},{"$f":"IF(D61=\"\",\"\",IF(D61<D60,IF(1+INDEX(C:C,MATCH(MAX(C$1:C60)+1,C$1:C60, 1))>12,1,1+INDEX(C:C,MATCH(MAX(C$1:C60)+1,C$1:C60, 1))),\"\"))","v":""},16,"播磨　貴代美",{"$f":"IF(E61=\"\",\"\",IF(COUNTIF(E$6:E60,E61)<1,\"初\",IFERROR(VLOOKUP(INDEX(F$1:F60,_xlfn.AGGREGATE(14,6,ROW(E$6:E60)/(E$6:E60=E61),1)),{\"申\",\"　\";\"　\",\"申\"},2,0),\"\")))","v":"　"},"西川　仁美",null,null,null,null,null,null,null,"播磨 西川   　"]
[null,{"$f":"IF(C62<>1,\"\",1+INDEX(B:B,MATCH(MAX(B$1:B61)+1,B$1:B61, 1)))","v":""},{"$f":"IF(D62=\"\",\"\",IF(D62<D61,IF(1+INDEX(C:C,MATCH(MAX(C$1:C61)+1,C$1:C61, 1))>12,1,1+INDEX(C:C,MATCH(MAX(C$1:C61)+1,C$1:C61, 1))),\"\"))","v":""},21,"高木　曜",{"$f":"IF(E62=\"\",\"\",IF(COUNTIF(E$6:E61,E62)<1,\"初\",IFERROR(VLOOKUP(INDEX(F$1:F61,_xlfn.AGGREGATE(14,6,ROW(E$6:E61)/(E$6:E61=E62),1)),{\"申\",\"　\";\"　\",\"申\"},2,0),\"\")))","v":"申"},"林　　 恵理",null,null,null,null,null,null,null,"高木 林   申"]
[null,{"$f":"IF(C63<>1,\"\",1+INDEX(B:B,MATCH(MAX(B$1:B62)+1,B$1:B62, 1)))","v":""},{"$f":"IF(D63=\"\",\"\",IF(D63<D62,IF(1+INDEX(C:C,MATCH(MAX(C$1:C62)+1,C$1:C62, 1))>12,1,1+INDEX(C:C,MATCH(MAX(C$1:C62)+1,C$1:C62, 1))),\"\"))","v":""},29,"河野　理子","申","林　　 恵理",null,null,null,null,null,null,null,"河野 林   申"]
[null,{"$f":"IF(C64<>1,\"\",1+INDEX(B:B,MATCH(MAX(B$1:B63)+1,B$1:B63, 1)))","v":""},{"$f":"IF(D64=\"\",\"\",IF(D64<D63,IF(1+INDEX(C:C,MATCH(MAX(C$1:C63)+1,C$1:C63, 1))>12,1,1+INDEX(C:C,MATCH(MAX(C$1:C63)+1,C$1:C63, 1))),\"\"))","v":8},3,"角　　 智美","申","３B　",null,null,null,null,null,null,null,"角 ３B   申"]
[null,{"$f":"IF(C65<>1,\"\",1+INDEX(B:B,MATCH(MAX(B$1:B64)+1,B$1:B64, 1)))","v":""},{"$f":"IF(D65=\"\",\"\",IF(D65<D64,IF(1+INDEX(C:C,MATCH(MAX(C$1:C64)+1,C$1:C64, 1))>12,1,1+INDEX(C:C,MATCH(MAX(C$1:C64)+1,C$1:C64, 1))),\"\"))","v":""},9,"福満　典子",{"$f":"IF(E65=\"\",\"\",IF(COUNTIF(E$6:E64,E65)<1,\"初\",IFERROR(VLOOKUP(INDEX(F$1:F64,_xlfn.AGGREGATE(14,6,ROW(E$6:E64)/(E$6:E64=E65),1)),{\"申\",\"　\";\"　\",\"申\"},2,0),\"\")))","v":"申"},"白水　恵美子",null,null,null,null,null,null,null,"福満 白水   申"]
[null,{"$f":"IF(C66<>1,\"\",1+INDEX(B:B,MATCH(MAX(B$1:B65)+1,B$1:B65, 1)))","v":""},{"$f":"IF(D66=\"\",\"\",IF(D66<D65,IF(1+INDEX(C:C,MATCH(MAX(C$1:C65)+1,C$1:C65, 1))>12,1,1+INDEX(C:C,MATCH(MAX(C$1:C65)+1,C$1:C65, 1))),\"\"))","v":""},17,"播磨　貴代美",{"$f":"IF(E66=\"\",\"\",IF(COUNTIF(E$6:E65,E66)<1,\"初\",IFERROR(VLOOKUP(INDEX(F$1:F65,_xlfn.AGGREGATE(14,6,ROW(E$6:E65)/(E$6:E65=E66),1)),{\"申\",\"　\";\"　\",\"申\"},2,0),\"\")))","v":"申"},"林　　 恵理",null,null,null,null,null,null,null,"播磨 林   申"]
[null,{"$f":"IF(C67<>1,\"\",1+INDEX(B:B,MATCH(MAX(B$1:B66)+1,B$1:B66, 1)))","v":""},{"$f":"IF(D67=\"\",\"\",IF(D67<D66,IF(1+INDEX(C:C,MATCH(MAX(C$1:C66)+1,C$1:C66, 1))>12,1,1+INDEX(C:C,MATCH(MAX(C$1:C66)+1,C$1:C66, 1))),\"\"))","v":""},24,"角　　 智美",{"$f":"IF(E67=\"\",\"\",IF(COUNTIF(E$6:E66,E67)<1,\"初\",IFERROR(VLOOKUP(INDEX(F$1:F66,_xlfn.AGGREGATE(14,6,ROW(E$6:E66)/(E$6:E66=E67),1)),{\"申\",\"　\";\"　\",\"申\"},2,0),\"\")))","v":"　"},"３B　",null,null,null,null,null,null,null,"角 ３B   　"]
[null,{"$f":"IF(C68<>1,\"\",1+INDEX(B:B,MATCH(MAX(B$1:B67)+1,B$1:B67, 1)))","v":""},{"$f":"IF(D68=\"\",\"\",IF(D68<D67,IF(1+INDEX(C:C,MATCH(MAX(C$1:C67)+1,C$1:C67, 1))>12,1,1+INDEX(C:C,MATCH(MAX(C$1:C67)+1,C$1:C67, 1))),\"\"))","v":9},1,"藤崎　登美江",{"$f":"IF(E68=\"\",\"\",IF(COUNTIF(E$6:E67,E68)<1,\"初\",IFERROR(VLOOKUP(INDEX(F$1:F67,_xlfn.AGGREGATE(14,6,ROW(E$6:E67)/(E$6:E67=E68),1)),{\"申\",\"　\";\"　\",\"申\"},2,0),\"\")))","v":"　"},"鎌田　幸一",null,null,null,null,null,null,null,"藤崎 鎌田   　"]
[null,{"$f":"IF(C69<>1,\"\",1+INDEX(B:B,MATCH(MAX(B$1:B68)+1,B$1:B68, 1)))","v":""},{"$f":"IF(D69=\"\",\"\",IF(D69<D68,IF(1+INDEX(C:C,MATCH(MAX(C$1:C68)+1,C$1:C68, 1))>12,1,1+INDEX(C:C,MATCH(MAX(C$1:C68)+1,C$1:C68, 1))),\"\"))","v":""},8,"柴田　由美",{"$f":"IF(E69=\"\",\"\",IF(COUNTIF(E$6:E68,E69)<1,\"初\",IFERROR(VLOOKUP(INDEX(F$1:F68,_xlfn.AGGREGATE(14,6,ROW(E$6:E68)/(E$6:E68=E69),1)),{\"申\",\"　\";\"　\",\"申\"},2,0),\"\")))","v":"　"},"西川　仁美",null,null,null,null,null,null,null,"柴田 西川   　"]
[null,{"$f":"IF(C70<>1,\"\",1+INDEX(B:B,MATCH(MAX(B$1:B69)+1,B$1:B69, 1)))","v":""},{"$f":"IF(D70=\"\",\"\",IF(D70<D69,IF(1+INDEX(C:C,MATCH(MAX(C$1:C69)+1,C$1:C69, 1))>12,1,1+INDEX(C:C,MATCH(MAX(C$1:C69)+1,C$1:C69, 1))),\"\"))","v":""},16,"福満　典子",{"$f":"IF(E70=\"\",\"\",IF(COUNTIF(E$6:E69,E70)<1,\"初\",IFERROR(VLOOKUP(INDEX(F$1:F69,_xlfn.AGGREGATE(14,6,ROW(E$6:E69)/(E$6:E69=E70),1)),{\"申\",\"　\";\"　\",\"申\"},2,0),\"\")))","v":"　"},"西川　仁美",null,null,null,null,null,null,null,"福満 西川   　"]
[null,{"$f":"IF(C71<>1,\"\",1+INDEX(B:B,MATCH(MAX(B$1:B70)+1,B$1:B70, 1)))","v":""},{"$f":"IF(D71=\"\",\"\",IF(D71<D70,IF(1+INDEX(C:C,MATCH(MAX(C$1:C70)+1,C$1:C70, 1))>12,1,1+INDEX(C:C,MATCH(MAX(C$1:C70)+1,C$1:C70, 1))),\"\"))","v":""},22,"高木　曜",{"$f":"IF(E71=\"\",\"\",IF(COUNTIF(E$6:E70,E71)<1,\"初\",IFERROR(VLOOKUP(INDEX(F$1:F70,_xlfn.AGGREGATE(14,6,ROW(E$6:E70)/(E$6:E70=E71),1)),{\"申\",\"　\";\"　\",\"申\"},2,0),\"\")))","v":"　"},"西川　仁美",null,null,null,null,null,null,null,"高木 西川   　"]
[null,{"$f":"IF(C72<>1,\"\",1+INDEX(B:B,MATCH(MAX(B$1:B71)+1,B$1:B71, 1)))","v":""},{"$f":"IF(D72=\"\",\"\",IF(D72<D71,IF(1+INDEX(C:C,MATCH(MAX(C$1:C71)+1,C$1:C71, 1))>12,1,1+INDEX(C:C,MATCH(MAX(C$1:C71)+1,C$1:C71, 1))),\"\"))","v":""},28,"角　　 智美",{"$f":"IF(E72=\"\",\"\",IF(COUNTIF(E$6:E71,E72)<1,\"初\",IFERROR(VLOOKUP(INDEX(F$1:F71,_xlfn.AGGREGATE(14,6,ROW(E$6:E71)/(E$6:E71=E72),1)),{\"申\",\"　\";\"　\",\"申\"},2,0),\"\")))","v":"申"},"３B　",null,null,null,null,null,null,null,"角 ３B   申"]
[null,{"$f":"IF(C73<>1,\"\",1+INDEX(B:B,MATCH(MAX(B$1:B72)+1,B$1:B72, 1)))","v":""},{"$f":"IF(D73=\"\",\"\",IF(D73<D72,IF(1+INDEX(C:C,MATCH(MAX(C$1:C72)+1,C$1:C72, 1))>12,1,1+INDEX(C:C,MATCH(MAX(C$1:C72)+1,C$1:C72, 1))),\"\"))","v":10},5,"斉藤　京子",{"$f":"IF(E73=\"\",\"\",IF(COUNTIF(E$6:E72,E73)<1,\"初\",IFERROR(VLOOKUP(INDEX(F$1:F72,_xlfn.AGGREGATE(14,6,ROW(E$6:E72)/(E$6:E72=E73),1)),{\"申\",\"　\";\"　\",\"申\"},2,0),\"\")))","v":"申"},"鎌田　幸一",null,null,null,"比嘉","(精)",null,null,"斉藤 鎌田 比嘉(精)  申"]
[null,{"$f":"IF(C74<>1,\"\",1+INDEX(B:B,MATCH(MAX(B$1:B73)+1,B$1:B73, 1)))","v":""},{"$f":"IF(D74=\"\",\"\",IF(D74<D73,IF(1+INDEX(C:C,MATCH(MAX(C$1:C73)+1,C$1:C73, 1))>12,1,1+INDEX(C:C,MATCH(MAX(C$1:C73)+1,C$1:C73, 1))),\"\"))","v":""},10,"播磨　貴代美",{"$f":"IF(E74=\"\",\"\",IF(COUNTIF(E$6:E73,E74)<1,\"初\",IFERROR(VLOOKUP(INDEX(F$1:F73,_xlfn.AGGREGATE(14,6,ROW(E$6:E73)/(E$6:E73=E74),1)),{\"申\",\"　\";\"　\",\"申\"},2,0),\"\")))","v":"　"},"鎌田　幸一",null,null,null,"倉沢","(内)",null,null,"播磨 鎌田 倉沢(内)  　"]
[null,{"$f":"IF(C75<>1,\"\",1+INDEX(B:B,MATCH(MAX(B$1:B74)+1,B$1:B74, 1)))","v":""},{"$f":"IF(D75=\"\",\"\",IF(D75<D74,IF(1+INDEX(C:C,MATCH(MAX(C$1:C74)+1,C$1:C74, 1))>12,1,1+INDEX(C:C,MATCH(MAX(C$1:C74)+1,C$1:C74, 1))),\"\"))","v":""},19,"角　　 智美",{"$f":"IF(E75=\"\",\"\",IF(COUNTIF(E$6:E74,E75)<1,\"初\",IFERROR(VLOOKUP(INDEX(F$1:F74,_xlfn.AGGREGATE(14,6,ROW(E$6:E74)/(E$6:E74=E75),1)),{\"申\",\"　\";\"　\",\"申\"},2,0),\"\")))","v":"　"},"３B　",null,null,null,"竹田","(精)",null,null,"角 ３B 竹田(精)  　"]
[null,{"$f":"IF(C76<>1,\"\",1+INDEX(B:B,MATCH(MAX(B$1:B75)+1,B$1:B75, 1)))","v":""},{"$f":"IF(D76=\"\",\"\",IF(D76<D75,IF(1+INDEX(C:C,MATCH(MAX(C$1:C75)+1,C$1:C75, 1))>12,1,1+INDEX(C:C,MATCH(MAX(C$1:C75)+1,C$1:C75, 1))),\"\"))","v":""},25,"藤崎　登美江",{"$f":"IF(E76=\"\",\"\",IF(COUNTIF(E$6:E75,E76)<1,\"初\",IFERROR(VLOOKUP(INDEX(F$1:F75,_xlfn.AGGREGATE(14,6,ROW(E$6:E75)/(E$6:E75=E76),1)),{\"申\",\"　\";\"　\",\"申\"},2,0),\"\")))","v":"申"},"林　　 恵理",null,null,null,"比嘉","(精)",null,null,"藤崎 林 比嘉(精)  申"]
[null,{"$f":"IF(C77<>1,\"\",1+INDEX(B:B,MATCH(MAX(B$1:B76)+1,B$1:B76, 1)))","v":""},{"$f":"IF(D77=\"\",\"\",IF(D77<D76,IF(1+INDEX(C:C,MATCH(MAX(C$1:C76)+1,C$1:C76, 1))>12,1,1+INDEX(C:C,MATCH(MAX(C$1:C76)+1,C$1:C76, 1))),\"\"))","v":""},30,"福田　美和子",{"$f":"IF(E77=\"\",\"\",IF(COUNTIF(E$6:E76,E77)<1,\"初\",IFERROR(VLOOKUP(INDEX(F$1:F76,_xlfn.AGGREGATE(14,6,ROW(E$6:E76)/(E$6:E76=E77),1)),{\"申\",\"　\";\"　\",\"申\"},2,0),\"\")))","v":"　"},"白水　恵美子",null,null,null,"松永","(外)",null,null,"福田 白水 松永(外)  　"]
[null,{"$f":"IF(C78<>1,\"\",1+INDEX(B:B,MATCH(MAX(B$1:B77)+1,B$1:B77, 1)))","v":""},{"$f":"IF(D78=\"\",\"\",IF(D78<D77,IF(1+INDEX(C:C,MATCH(MAX(C$1:C77)+1,C$1:C77, 1))>12,1,1+INDEX(C:C,MATCH(MAX(C$1:C77)+1,C$1:C77, 1))),\"\"))","v":11},5,"福満　典子","　","白水　恵美子",null,null,null,null,null,null,null,"福満 白水   　"]
[null,{"$f":"IF(C79<>1,\"\",1+INDEX(B:B,MATCH(MAX(B$1:B78)+1,B$1:B78, 1)))","v":""},{"$f":"IF(D79=\"\",\"\",IF(D79<D78,IF(1+INDEX(C:C,MATCH(MAX(C$1:C78)+1,C$1:C78, 1))>12,1,1+INDEX(C:C,MATCH(MAX(C$1:C78)+1,C$1:C78, 1))),\"\"))","v":""},10,"福満　典子",{"$f":"IF(E79=\"\",\"\",IF(COUNTIF(E$6:E78,E79)<1,\"初\",IFERROR(VLOOKUP(INDEX(F$1:F78,_xlfn.AGGREGATE(14,6,ROW(E$6:E78)/(E$6:E78=E79),1)),{\"申\",\"　\";\"　\",\"申\"},2,0),\"\")))","v":"申"},"林　　 恵理",null,null,null,"畑部","(精)","【外線】",null,"福満 林 畑部(精) 【外線】 申"]
[null,{"$f":"IF(C80<>1,\"\",1+INDEX(B:B,MATCH(MAX(B$1:B79)+1,B$1:B79, 1)))","v":""},{"$f":"IF(D80=\"\",\"\",IF(D80<D79,IF(1+INDEX(C:C,MATCH(MAX(C$1:C79)+1,C$1:C79, 1))>12,1,1+INDEX(C:C,MATCH(MAX(C$1:C79)+1,C$1:C79, 1))),\"\"))","v":""},16,"福満　典子",{"$f":"IF(E80=\"\",\"\",IF(COUNTIF(E$6:E79,E80)<1,\"初\",IFERROR(VLOOKUP(INDEX(F$1:F79,_xlfn.AGGREGATE(14,6,ROW(E$6:E79)/(E$6:E79=E80),1)),{\"申\",\"　\";\"　\",\"申\"},2,0),\"\")))","v":"　"},"福満　典子",null,null,null,null,null,null,null,"福満 福満   　"]
[null,{"$f":"IF(C81<>1,\"\",1+INDEX(B:B,MATCH(MAX(B$1:B80)+1,B$1:B80, 1)))","v":""},{"$f":"IF(D81=\"\",\"\",IF(D81<D80,IF(1+INDEX(C:C,MATCH(MAX(C$1:C80)+1,C$1:C80, 1))>12,1,1+INDEX(C:C,MATCH(MAX(C$1:C80)+1,C$1:C80, 1))),\"\"))","v":""},23,"藤崎　登美江",{"$f":"IF(E81=\"\",\"\",IF(COUNTIF(E$6:E80,E81)<1,\"初\",IFERROR(VLOOKUP(INDEX(F$1:F80,_xlfn.AGGREGATE(14,6,ROW(E$6:E80)/(E$6:E80=E81),1)),{\"申\",\"　\";\"　\",\"申\"},2,0),\"\")))","v":"　"},"３B　",null,null,null,null,null,null,null,"藤崎 ３B   　"]
[null,{"$f":"IF(C82<>1,\"\",1+INDEX(B:B,MATCH(MAX(B$1:B81)+1,B$1:B81, 1)))","v":""},{"$f":"IF(D82=\"\",\"\",IF(D82<D81,IF(1+INDEX(C:C,MATCH(MAX(C$1:C81)+1,C$1:C81, 1))>12,1,1+INDEX(C:C,MATCH(MAX(C$1:C81)+1,C$1:C81, 1))),\"\"))","v":""},29,"斉藤　京子",{"$f":"IF(E82=\"\",\"\",IF(COUNTIF(E$6:E81,E82)<1,\"初\",IFERROR(VLOOKUP(INDEX(F$1:F81,_xlfn.AGGREGATE(14,6,ROW(E$6:E81)/(E$6:E81=E82),1)),{\"申\",\"　\";\"　\",\"申\"},2,0),\"\")))","v":"　"},"白水　恵美子",null,null,null,null,null,null,null,"斉藤 白水   　"]
[null,{"$f":"IF(C83<>1,\"\",1+INDEX(B:B,MATCH(MAX(B$1:B82)+1,B$1:B82, 1)))","v":""},{"$f":"IF(D83=\"\",\"\",IF(D83<D82,IF(1+INDEX(C:C,MATCH(MAX(C$1:C82)+1,C$1:C82, 1))>12,1,1+INDEX(C:C,MATCH(MAX(C$1:C82)+1,C$1:C82, 1))),\"\"))","v":12},5,"斉藤　京子",{"$f":"IF(E83=\"\",\"\",IF(COUNTIF(E$6:E82,E83)<1,\"初\",IFERROR(VLOOKUP(INDEX(F$1:F82,_xlfn.AGGREGATE(14,6,ROW(E$6:E82)/(E$6:E82=E83),1)),{\"申\",\"　\";\"　\",\"申\"},2,0),\"\")))","v":"申"},"西川　仁美",null,null,null,null,null,null,null,"斉藤 西川   申"]
[null,{"$f":"IF(C84<>1,\"\",1+INDEX(B:B,MATCH(MAX(B$1:B83)+1,B$1:B83, 1)))","v":""},{"$f":"IF(D84=\"\",\"\",IF(D84<D83,IF(1+INDEX(C:C,MATCH(MAX(C$1:C83)+1,C$1:C83, 1))>12,1,1+INDEX(C:C,MATCH(MAX(C$1:C83)+1,C$1:C83, 1))),\"\"))","v":""},11,"福満　典子","　","３B　","小幡Dr",null,null,"井上","(外)","【外線】",null,{"$f":"IF(ISERROR(LEFT(E84,FIND(\"　\",E84,1)-1)&\" \"&LEFT(G84,FIND(\"　\",G84,1)-1)&\" \"&K84&L84&\" \"&H84&IF(I84<>\"\",\"or\"&I84,\"\")&J84&M84&N84), \"\", LEFT(E84,FIND(\"　\",E84,1)-1)&\" \"&LEFT(G84,FIND(\"　\",G84,1)-1)&\" \"&K84&L84&\" \"&H84&IF(I84<>\"\",\"or\"&I84,\"\")&J84&M84&N84)&\" \"&F84","v":"福満 ３B 井上(外) 小幡Dr【外線】 　"}]
[null,{"$f":"IF(C85<>1,\"\",1+INDEX(B:B,MATCH(MAX(B$1:B84)+1,B$1:B84, 1)))","v":""},{"$f":"IF(D85=\"\",\"\",IF(D85<D84,IF(1+INDEX(C:C,MATCH(MAX(C$1:C84)+1,C$1:C84, 1))>12,1,1+INDEX(C:C,MATCH(MAX(C$1:C84)+1,C$1:C84, 1))),\"\"))","v":""},16,"福満　典子",{"$f":"IF(E85=\"\",\"\",IF(COUNTIF(E$6:E84,E85)<1,\"初\",IFERROR(VLOOKUP(INDEX(F$1:F84,_xlfn.AGGREGATE(14,6,ROW(E$6:E84)/(E$6:E84=E85),1)),{\"申\",\"　\";\"　\",\"申\"},2,0),\"\")))","v":"申"},"３B　",null,null,null,null,null,null,null,"福満 ３B   申"]
[null,{"$f":"IF(C86<>1,\"\",1+INDEX(B:B,MATCH(MAX(B$1:B85)+1,B$1:B85, 1)))","v":""},{"$f":"IF(D86=\"\",\"\",IF(D86<D85,IF(1+INDEX(C:C,MATCH(MAX(C$1:C85)+1,C$1:C85, 1))>12,1,1+INDEX(C:C,MATCH(MAX(C$1:C85)+1,C$1:C85, 1))),\"\"))","v":""},21,"高木　曜",{"$f":"IF(E86=\"\",\"\",IF(COUNTIF(E$6:E85,E86)<1,\"初\",IFERROR(VLOOKUP(INDEX(F$1:F85,_xlfn.AGGREGATE(14,6,ROW(E$6:E85)/(E$6:E85=E86),1)),{\"申\",\"　\";\"　\",\"申\"},2,0),\"\")))","v":"申"},"３B　",null,null,null,null,null,null,null,"高木 ３B   申"]
[null,{"$f":"IF(C87<>1,\"\",1+INDEX(B:B,MATCH(MAX(B$1:B86)+1,B$1:B86, 1)))","v":""},{"$f":"IF(D87=\"\",\"\",IF(D87<D86,IF(1+INDEX(C:C,MATCH(MAX(C$1:C86)+1,C$1:C86, 1))>12,1,1+INDEX(C:C,MATCH(MAX(C$1:C86)+1,C$1:C86, 1))),\"\"))","v":""},28,"福田　美和子","　","工藤　里美",null,null,null,null,null,null,null,"福田 工藤   　"]
[null,{"$f":"IF(C88<>1,\"\",1+INDEX(B:B,MATCH(MAX(B$1:B87)+1,B$1:B87, 1)))","v":2022},{"$f":"IF(D88=\"\",\"\",IF(D88<D87,IF(1+INDEX(C:C,MATCH(MAX(C$1:C87)+1,C$1:C87, 1))>12,1,1+INDEX(C:C,MATCH(MAX(C$1:C87)+1,C$1:C87, 1))),\"\"))","v":1},2,"柴田　由美",{"$f":"IF(E88=\"\",\"\",IF(COUNTIF(E$6:E87,E88)<1,\"初\",IFERROR(VLOOKUP(INDEX(F$1:F87,_xlfn.AGGREGATE(14,6,ROW(E$6:E87)/(E$6:E87=E88),1)),{\"申\",\"　\";\"　\",\"申\"},2,0),\"\")))","v":"申"},"林　　 恵理",null,null,null,null,null,null,null,"柴田 林   申"]
[null,{"$f":"IF(C89<>1,\"\",1+INDEX(B:B,MATCH(MAX(B$1:B88)+1,B$1:B88, 1)))","v":""},{"$f":"IF(D89=\"\",\"\",IF(D89<D88,IF(1+INDEX(C:C,MATCH(MAX(C$1:C88)+1,C$1:C88, 1))>12,1,1+INDEX(C:C,MATCH(MAX(C$1:C88)+1,C$1:C88, 1))),\"\"))","v":""},8,"高木　曜",{"$f":"IF(E89=\"\",\"\",IF(COUNTIF(E$6:E88,E89)<1,\"初\",IFERROR(VLOOKUP(INDEX(F$1:F88,_xlfn.AGGREGATE(14,6,ROW(E$6:E88)/(E$6:E88=E89),1)),{\"申\",\"　\";\"　\",\"申\"},2,0),\"\")))","v":"　"},"白水　恵美子",null,null,null,"井上 ","(外)","【外線】",null,"高木 白水 井上 (外) 【外線】 　"]
[null,{"$f":"IF(C90<>1,\"\",1+INDEX(B:B,MATCH(MAX(B$1:B89)+1,B$1:B89, 1)))","v":""},{"$f":"IF(D90=\"\",\"\",IF(D90<D89,IF(1+INDEX(C:C,MATCH(MAX(C$1:C89)+1,C$1:C89, 1))>12,1,1+INDEX(C:C,MATCH(MAX(C$1:C89)+1,C$1:C89, 1))),\"\"))","v":""},15,"高木　曜",{"$f":"IF(E90=\"\",\"\",IF(COUNTIF(E$6:E89,E90)<1,\"初\",IFERROR(VLOOKUP(INDEX(F$1:F89,_xlfn.AGGREGATE(14,6,ROW(E$6:E89)/(E$6:E89=E90),1)),{\"申\",\"　\";\"　\",\"申\"},2,0),\"\")))","v":"申"},"林　　 恵理",null,null,null,null,null,null,null,"高木 林   申"]
[null,{"$f":"IF(C91<>1,\"\",1+INDEX(B:B,MATCH(MAX(B$1:B90)+1,B$1:B90, 1)))","v":""},{"$f":"IF(D91=\"\",\"\",IF(D91<D90,IF(1+INDEX(C:C,MATCH(MAX(C$1:C90)+1,C$1:C90, 1))>12,1,1+INDEX(C:C,MATCH(MAX(C$1:C90)+1,C$1:C90, 1))),\"\"))","v":""},23,"播磨　貴代美",{"$f":"IF(E91=\"\",\"\",IF(COUNTIF(E$6:E90,E91)<1,\"初\",IFERROR(VLOOKUP(INDEX(F$1:F90,_xlfn.AGGREGATE(14,6,ROW(E$6:E90)/(E$6:E90=E91),1)),{\"申\",\"　\";\"　\",\"申\"},2,0),\"\")))","v":"申"},"工藤　里美",null,null,null,null,null,null,null,"播磨 工藤   申"]
[null,{"$f":"IF(C92<>1,\"\",1+INDEX(B:B,MATCH(MAX(B$1:B91)+1,B$1:B91, 1)))","v":""},{"$f":"IF(D92=\"\",\"\",IF(D92<D91,IF(1+INDEX(C:C,MATCH(MAX(C$1:C91)+1,C$1:C91, 1))>12,1,1+INDEX(C:C,MATCH(MAX(C$1:C91)+1,C$1:C91, 1))),\"\"))","v":""},30,"角　　 智美",{"$f":"IF(E92=\"\",\"\",IF(COUNTIF(E$6:E91,E92)<1,\"初\",IFERROR(VLOOKUP(INDEX(F$1:F91,_xlfn.AGGREGATE(14,6,ROW(E$6:E91)/(E$6:E91=E92),1)),{\"申\",\"　\";\"　\",\"申\"},2,0),\"\")))","v":"申"},"白水　恵美子",null,null,null,null,null,null,null,"角 白水   申"]
[null,{"$f":"IF(C93<>1,\"\",1+INDEX(B:B,MATCH(MAX(B$1:B92)+1,B$1:B92, 1)))","v":""},{"$f":"IF(D93=\"\",\"\",IF(D93<D92,IF(1+INDEX(C:C,MATCH(MAX(C$1:C92)+1,C$1:C92, 1))>12,1,1+INDEX(C:C,MATCH(MAX(C$1:C92)+1,C$1:C92, 1))),\"\"))","v":2},5,"角　　 智美",{"$f":"IF(E93=\"\",\"\",IF(COUNTIF(E$6:E92,E93)<1,\"初\",IFERROR(VLOOKUP(INDEX(F$1:F92,_xlfn.AGGREGATE(14,6,ROW(E$6:E92)/(E$6:E92=E93),1)),{\"申\",\"　\";\"　\",\"申\"},2,0),\"\")))","v":"　"},"工藤　里美","院長",null,null,"松永","(外)","【外線】",null,"角 工藤 松永(外) 院長【外線】 　"]
[null,{"$f":"IF(C94<>1,\"\",1+INDEX(B:B,MATCH(MAX(B$1:B93)+1,B$1:B93, 1)))","v":""},{"$f":"IF(D94=\"\",\"\",IF(D94<D93,IF(1+INDEX(C:C,MATCH(MAX(C$1:C93)+1,C$1:C93, 1))>12,1,1+INDEX(C:C,MATCH(MAX(C$1:C93)+1,C$1:C93, 1))),\"\"))","v":""},10,"福田　美和子",{"$f":"IF(E94=\"\",\"\",IF(COUNTIF(E$6:E93,E94)<1,\"初\",IFERROR(VLOOKUP(INDEX(F$1:F93,_xlfn.AGGREGATE(14,6,ROW(E$6:E93)/(E$6:E93=E94),1)),{\"申\",\"　\";\"　\",\"申\"},2,0),\"\")))","v":"申"},"林　　 恵理",null,null,null,null,null,null,null,"福田 林   申"]
[null,{"$f":"IF(C95<>1,\"\",1+INDEX(B:B,MATCH(MAX(B$1:B94)+1,B$1:B94, 1)))","v":""},{"$f":"IF(D95=\"\",\"\",IF(D95<D94,IF(1+INDEX(C:C,MATCH(MAX(C$1:C94)+1,C$1:C94, 1))>12,1,1+INDEX(C:C,MATCH(MAX(C$1:C94)+1,C$1:C94, 1))),\"\"))","v":""},18,"高木　曜",{"$f":"IF(E95=\"\",\"\",IF(COUNTIF(E$6:E94,E95)<1,\"初\",IFERROR(VLOOKUP(INDEX(F$1:F94,_xlfn.AGGREGATE(14,6,ROW(E$6:E94)/(E$6:E94=E95),1)),{\"申\",\"　\";\"　\",\"申\"},2,0),\"\")))","v":"　"},"林　　 恵理",null,null,null,null,null,null,null,{"$f":"IF(ISERROR(LEFT(E95,FIND(\"　\",E95,1)-1)&\" \"&LEFT(G95,FIND(\"　\",G95,1)-1)&\" \"&K95&L95&\" \"&H95&IF(I95<>\"\",\"or\"&I95,\"\")&J95&M95&N95), \"\", LEFT(E95,FIND(\"　\",E95,1)-1)&\" \"&LEFT(G95,FIND(\"　\",G95,1)-1)&\" \"&K95&L95&\" \"&H95&IF(I95<>\"\",\"or\"&I95,\"\")&J95&M95&N95)&\" \"&F95","v":"高木 林   　"}]
[null,{"$f":"IF(C96<>1,\"\",1+INDEX(B:B,MATCH(MAX(B$1:B95)+1,B$1:B95, 1)))","v":""},{"$f":"IF(D96=\"\",\"\",IF(D96<D95,IF(1+INDEX(C:C,MATCH(MAX(C$1:C95)+1,C$1:C95, 1))>12,1,1+INDEX(C:C,MATCH(MAX(C$1:C95)+1,C$1:C95, 1))),\"\"))","v":""},23,"福満　典子",{"$f":"IF(E96=\"\",\"\",IF(COUNTIF(E$6:E95,E96)<1,\"初\",IFERROR(VLOOKUP(INDEX(F$1:F95,_xlfn.AGGREGATE(14,6,ROW(E$6:E95)/(E$6:E95=E96),1)),{\"申\",\"　\";\"　\",\"申\"},2,0),\"\")))","v":"　"},"３B　",null,null,null,null,null,null,null,"福満 ３B   　"]
[null,{"$f":"IF(C97<>1,\"\",1+INDEX(B:B,MATCH(MAX(B$1:B96)+1,B$1:B96, 1)))","v":""},{"$f":"IF(D97=\"\",\"\",IF(D97<D96,IF(1+INDEX(C:C,MATCH(MAX(C$1:C96)+1,C$1:C96, 1))>12,1,1+INDEX(C:C,MATCH(MAX(C$1:C96)+1,C$1:C96, 1))),\"\"))","v":3},6,"福満　典子",{"$f":"IF(E97=\"\",\"\",IF(COUNTIF(E$6:E96,E97)<1,\"初\",IFERROR(VLOOKUP(INDEX(F$1:F96,_xlfn.AGGREGATE(14,6,ROW(E$6:E96)/(E$6:E96=E97),1)),{\"申\",\"　\";\"　\",\"申\"},2,0),\"\")))","v":"申"},"３B　","松岡Dr",null,null,null,null,"【外線】",null,"福満 ３B  松岡Dr【外線】 申"]
[null,{"$f":"IF(C98<>1,\"\",1+INDEX(B:B,MATCH(MAX(B$1:B97)+1,B$1:B97, 1)))","v":""},{"$f":"IF(D98=\"\",\"\",IF(D98<D97,IF(1+INDEX(C:C,MATCH(MAX(C$1:C97)+1,C$1:C97, 1))>12,1,1+INDEX(C:C,MATCH(MAX(C$1:C97)+1,C$1:C97, 1))),\"\"))","v":""},14,"柴田　由美",{"$f":"IF(E98=\"\",\"\",IF(COUNTIF(E$6:E97,E98)<1,\"初\",IFERROR(VLOOKUP(INDEX(F$1:F97,_xlfn.AGGREGATE(14,6,ROW(E$6:E97)/(E$6:E97=E98),1)),{\"申\",\"　\";\"　\",\"申\"},2,0),\"\")))","v":"　"},"３B　",null,null,null,null,null,null,null,"柴田 ３B   　"]
[null,{"$f":"IF(C99<>1,\"\",1+INDEX(B:B,MATCH(MAX(B$1:B98)+1,B$1:B98, 1)))","v":""},{"$f":"IF(D99=\"\",\"\",IF(D99<D98,IF(1+INDEX(C:C,MATCH(MAX(C$1:C98)+1,C$1:C98, 1))>12,1,1+INDEX(C:C,MATCH(MAX(C$1:C98)+1,C$1:C98, 1))),\"\"))","v":""},19,"藤崎　登美江",{"$f":"IF(E99=\"\",\"\",IF(COUNTIF(E$6:E98,E99)<1,\"初\",IFERROR(VLOOKUP(INDEX(F$1:F98,_xlfn.AGGREGATE(14,6,ROW(E$6:E98)/(E$6:E98=E99),1)),{\"申\",\"　\";\"　\",\"申\"},2,0),\"\")))","v":"申"},"工藤　里美",null,null,null,null,null,null,null,"藤崎 工藤   申"]
[null,{"$f":"IF(C100<>1,\"\",1+INDEX(B:B,MATCH(MAX(B$1:B99)+1,B$1:B99, 1)))","v":""},{"$f":"IF(D100=\"\",\"\",IF(D100<D99,IF(1+INDEX(C:C,MATCH(MAX(C$1:C99)+1,C$1:C99, 1))>12,1,1+INDEX(C:C,MATCH(MAX(C$1:C99)+1,C$1:C99, 1))),\"\"))","v":""},25,"播磨　貴代美",{"$f":"IF(E100=\"\",\"\",IF(COUNTIF(E$6:E99,E100)<1,\"初\",IFERROR(VLOOKUP(INDEX(F$1:F99,_xlfn.AGGREGATE(14,6,ROW(E$6:E99)/(E$6:E99=E100),1)),{\"申\",\"　\";\"　\",\"申\"},2,0),\"\")))","v":"　"},"３B　",null,null,null,null,null,null,null,"播磨 ３B   　"]
[null,{"$f":"IF(C101<>1,\"\",1+INDEX(B:B,MATCH(MAX(B$1:B100)+1,B$1:B100, 1)))","v":""},{"$f":"IF(D101=\"\",\"\",IF(D101<D100,IF(1+INDEX(C:C,MATCH(MAX(C$1:C100)+1,C$1:C100, 1))>12,1,1+INDEX(C:C,MATCH(MAX(C$1:C100)+1,C$1:C100, 1))),\"\"))","v":""},31,"福満　典子",{"$f":"IF(E101=\"\",\"\",IF(COUNTIF(E$6:E100,E101)<1,\"初\",IFERROR(VLOOKUP(INDEX(F$1:F100,_xlfn.AGGREGATE(14,6,ROW(E$6:E100)/(E$6:E100=E101),1)),{\"申\",\"　\";\"　\",\"申\"},2,0),\"\")))","v":"　"},"白水　恵美子","松岡",null,null,null,null,"【外線】",null,"福満 白水  松岡【外線】 　"]
[null,{"$f":"IF(C102<>1,\"\",1+INDEX(B:B,MATCH(MAX(B$1:B101)+1,B$1:B101, 1)))","v":""},null,22,"斉藤　京子",{"$f":"IF(E102=\"\",\"\",IF(COUNTIF(E$6:E101,E102)<1,\"初\",IFERROR(VLOOKUP(INDEX(F$1:F101,_xlfn.AGGREGATE(14,6,ROW(E$6:E101)/(E$6:E101=E102),1)),{\"申\",\"　\";\"　\",\"申\"},2,0),\"\")))","v":"　"},"白水　恵美子",null,null,null,null,null,null,null,{"$f":"IF(ISERROR(LEFT(E102,FIND(\"　\",E102,1)-1)&\" \"&LEFT(G102,FIND(\"　\",G102,1)-1)&\" \"&K102&L102&\" \"&H102&IF(I102<>\"\",\"or\"&I102,\"\")&J102&M102&N102), \"\", LEFT(E102,FIND(\"　\",E102,1)-1)&\" \"&LEFT(G102,FIND(\"　\",G102,1)-1)&\" \"&K102&L102&\" \"&H102&IF(I102<>\"\",\"or\"&I102,\"\")&J102&M102&N102)&\" \"&F102","v":"斉藤 白水   　"}]
[null,{"$f":"IF(C103<>1,\"\",1+INDEX(B:B,MATCH(MAX(B$1:B102)+1,B$1:B102, 1)))","v":""},{"$f":"IF(D103=\"\",\"\",IF(D103<D102,IF(1+INDEX(C:C,MATCH(MAX(C$1:C102)+1,C$1:C102, 1))>12,1,1+INDEX(C:C,MATCH(MAX(C$1:C102)+1,C$1:C102, 1))),\"\"))","v":4},6,"土田　尚徳","　","工藤　里美",null,null,null,null,null,null,null,"土田 工藤   　"]
[null,{"$f":"IF(C104<>1,\"\",1+INDEX(B:B,MATCH(MAX(B$1:B103)+1,B$1:B103, 1)))","v":""},{"$f":"IF(D104=\"\",\"\",IF(D104<D103,IF(1+INDEX(C:C,MATCH(MAX(C$1:C103)+1,C$1:C103, 1))>12,1,1+INDEX(C:C,MATCH(MAX(C$1:C103)+1,C$1:C103, 1))),\"\"))","v":""},14,"斉藤　京子",{"$f":"IF(E104=\"\",\"\",IF(COUNTIF(E$6:E103,E104)<1,\"初\",IFERROR(VLOOKUP(INDEX(F$1:F103,_xlfn.AGGREGATE(14,6,ROW(E$6:E103)/(E$6:E103=E104),1)),{\"申\",\"　\";\"　\",\"申\"},2,0),\"\")))","v":"申"},"林　　 恵理",null,null,null,null,null,null,null,"斉藤 林   申"]
[null,{"$f":"IF(C105<>1,\"\",1+INDEX(B:B,MATCH(MAX(B$1:B104)+1,B$1:B104, 1)))","v":""},{"$f":"IF(D105=\"\",\"\",IF(D105<D104,IF(1+INDEX(C:C,MATCH(MAX(C$1:C104)+1,C$1:C104, 1))>12,1,1+INDEX(C:C,MATCH(MAX(C$1:C104)+1,C$1:C104, 1))),\"\"))","v":""},21,"小山　智","　","林　　 恵理",null,null,null,null,null,null,null,"小山 林   　"]
[null,{"$f":"IF(C106<>1,\"\",1+INDEX(B:B,MATCH(MAX(B$1:B105)+1,B$1:B105, 1)))","v":""},{"$f":"IF(D106=\"\",\"\",IF(D106<D105,IF(1+INDEX(C:C,MATCH(MAX(C$1:C105)+1,C$1:C105, 1))>12,1,1+INDEX(C:C,MATCH(MAX(C$1:C105)+1,C$1:C105, 1))),\"\"))","v":""},28,"福田　美和子",{"$f":"IF(E106=\"\",\"\",IF(COUNTIF(E$6:E105,E106)<1,\"初\",IFERROR(VLOOKUP(INDEX(F$1:F105,_xlfn.AGGREGATE(14,6,ROW(E$6:E105)/(E$6:E105=E106),1)),{\"申\",\"　\";\"　\",\"申\"},2,0),\"\")))","v":"　"},"工藤　里美",null,null,null,null,null,"【外線】",null,"福田 工藤  【外線】 　"]
[null,{"$f":"IF(C107<>1,\"\",1+INDEX(B:B,MATCH(MAX(B$1:B106)+1,B$1:B106, 1)))","v":""},{"$f":"IF(D107=\"\",\"\",IF(D107<D106,IF(1+INDEX(C:C,MATCH(MAX(C$1:C106)+1,C$1:C106, 1))>12,1,1+INDEX(C:C,MATCH(MAX(C$1:C106)+1,C$1:C106, 1))),\"\"))","v":5},3,"播磨　貴代美",{"$f":"IF(E107=\"\",\"\",IF(COUNTIF(E$6:E106,E107)<1,\"初\",IFERROR(VLOOKUP(INDEX(F$1:F106,_xlfn.AGGREGATE(14,6,ROW(E$6:E106)/(E$6:E106=E107),1)),{\"申\",\"　\";\"　\",\"申\"},2,0),\"\")))","v":"申"},"林　　 恵理",null,null,null,null,null,null,null,"播磨 林   申"]
[null,{"$f":"IF(C108<>1,\"\",1+INDEX(B:B,MATCH(MAX(B$1:B107)+1,B$1:B107, 1)))","v":""},{"$f":"IF(D108=\"\",\"\",IF(D108<D107,IF(1+INDEX(C:C,MATCH(MAX(C$1:C107)+1,C$1:C107, 1))>12,1,1+INDEX(C:C,MATCH(MAX(C$1:C107)+1,C$1:C107, 1))),\"\"))","v":""},8,"福満　典子",{"$f":"IF(E108=\"\",\"\",IF(COUNTIF(E$6:E107,E108)<1,\"初\",IFERROR(VLOOKUP(INDEX(F$1:F107,_xlfn.AGGREGATE(14,6,ROW(E$6:E107)/(E$6:E107=E108),1)),{\"申\",\"　\";\"　\",\"申\"},2,0),\"\")))","v":"申"},"工藤　里美",null,null,null,null,null,null,null,"福満 工藤   申"]
[null,{"$f":"IF(C109<>1,\"\",1+INDEX(B:B,MATCH(MAX(B$1:B108)+1,B$1:B108, 1)))","v":""},{"$f":"IF(D109=\"\",\"\",IF(D109<D108,IF(1+INDEX(C:C,MATCH(MAX(C$1:C108)+1,C$1:C108, 1))>12,1,1+INDEX(C:C,MATCH(MAX(C$1:C108)+1,C$1:C108, 1))),\"\"))","v":""},15,"後藤　徹矢","申","林　　 恵理",null,null,null,null,null,null,null,"後藤 林   申"]
[null,{"$f":"IF(C110<>1,\"\",1+INDEX(B:B,MATCH(MAX(B$1:B109)+1,B$1:B109, 1)))","v":""},{"$f":"IF(D110=\"\",\"\",IF(D110<D109,IF(1+INDEX(C:C,MATCH(MAX(C$1:C109)+1,C$1:C109, 1))>12,1,1+INDEX(C:C,MATCH(MAX(C$1:C109)+1,C$1:C109, 1))),\"\"))","v":""},21,"福田　美和子",{"$f":"IF(E110=\"\",\"\",IF(COUNTIF(E$6:E109,E110)<1,\"初\",IFERROR(VLOOKUP(INDEX(F$1:F109,_xlfn.AGGREGATE(14,6,ROW(E$6:E109)/(E$6:E109=E110),1)),{\"申\",\"　\";\"　\",\"申\"},2,0),\"\")))","v":"申"},"白水　恵美子",null,null,null,null,null,null,null,"福田 白水   申"]
[null,{"$f":"IF(C111<>1,\"\",1+INDEX(B:B,MATCH(MAX(B$1:B110)+1,B$1:B110, 1)))","v":""},{"$f":"IF(D111=\"\",\"\",IF(D111<D110,IF(1+INDEX(C:C,MATCH(MAX(C$1:C110)+1,C$1:C110, 1))>12,1,1+INDEX(C:C,MATCH(MAX(C$1:C110)+1,C$1:C110, 1))),\"\"))","v":""},27,"土田　尚徳",{"$f":"IF(E111=\"\",\"\",IF(COUNTIF(E$6:E110,E111)<1,\"初\",IFERROR(VLOOKUP(INDEX(F$1:F110,_xlfn.AGGREGATE(14,6,ROW(E$6:E110)/(E$6:E110=E111),1)),{\"申\",\"　\";\"　\",\"申\"},2,0),\"\")))","v":"申"},"工藤　里美",null,null,null,null,null,"【外線】",null,"土田 工藤  【外線】 申"]
[null,{"$f":"IF(C112<>1,\"\",1+INDEX(B:B,MATCH(MAX(B$1:B111)+1,B$1:B111, 1)))","v":""},{"$f":"IF(D112=\"\",\"\",IF(D112<D111,IF(1+INDEX(C:C,MATCH(MAX(C$1:C111)+1,C$1:C111, 1))>12,1,1+INDEX(C:C,MATCH(MAX(C$1:C111)+1,C$1:C111, 1))),\"\"))","v":6},5,"森田　りよ子","申","工藤　里美","松岡",null,null,"升井Dr","(内)",null,null,"森田 工藤 升井Dr(内) 松岡 申"]
[null,{"$f":"IF(C113<>1,\"\",1+INDEX(B:B,MATCH(MAX(B$1:B112)+1,B$1:B112, 1)))","v":""},{"$f":"IF(D113=\"\",\"\",IF(D113<D112,IF(1+INDEX(C:C,MATCH(MAX(C$1:C112)+1,C$1:C112, 1))>12,1,1+INDEX(C:C,MATCH(MAX(C$1:C112)+1,C$1:C112, 1))),\"\"))","v":""},11,"角　　 智美",{"$f":"IF(E113=\"\",\"\",IF(COUNTIF(E$6:E112,E113)<1,\"初\",IFERROR(VLOOKUP(INDEX(F$1:F112,_xlfn.AGGREGATE(14,6,ROW(E$6:E112)/(E$6:E112=E113),1)),{\"申\",\"　\";\"　\",\"申\"},2,0),\"\")))","v":"申"},"赤松　修","小幡",null,"《第2》","井上Dr","(外)",null,null,"角 赤松 井上Dr(外) 小幡《第2》 申"]
[null,{"$f":"IF(C114<>1,\"\",1+INDEX(B:B,MATCH(MAX(B$1:B113)+1,B$1:B113, 1)))","v":""},{"$f":"IF(D114=\"\",\"\",IF(D114<D113,IF(1+INDEX(C:C,MATCH(MAX(C$1:C113)+1,C$1:C113, 1))>12,1,1+INDEX(C:C,MATCH(MAX(C$1:C113)+1,C$1:C113, 1))),\"\"))","v":""},16,"福満　典子",{"$f":"IF(E114=\"\",\"\",IF(COUNTIF(E$6:E113,E114)<1,\"初\",IFERROR(VLOOKUP(INDEX(F$1:F113,_xlfn.AGGREGATE(14,6,ROW(E$6:E113)/(E$6:E113=E114),1)),{\"申\",\"　\";\"　\",\"申\"},2,0),\"\")))","v":"　"},"工藤　里美","松岡",null,null,"浪花Ｄｒ","(精)",null,null,"福満 工藤 浪花Ｄｒ(精) 松岡 　"]
[null,{"$f":"IF(C115<>1,\"\",1+INDEX(B:B,MATCH(MAX(B$1:B114)+1,B$1:B114, 1)))","v":""},{"$f":"IF(D115=\"\",\"\",IF(D115<D114,IF(1+INDEX(C:C,MATCH(MAX(C$1:C114)+1,C$1:C114, 1))>12,1,1+INDEX(C:C,MATCH(MAX(C$1:C114)+1,C$1:C114, 1))),\"\"))","v":""},26,"斉藤　京子",{"$f":"IF(E115=\"\",\"\",IF(COUNTIF(E$6:E114,E115)<1,\"初\",IFERROR(VLOOKUP(INDEX(F$1:F114,_xlfn.AGGREGATE(14,6,ROW(E$6:E114)/(E$6:E114=E115),1)),{\"申\",\"　\";\"　\",\"申\"},2,0),\"\")))","v":"　"},"友池　明日香","島野",null,null,"松本Dr","(内)","【外線】",null,"斉藤 友池 松本Dr(内) 島野【外線】 　"]
[null,{"$f":"IF(C116<>1,\"\",1+INDEX(B:B,MATCH(MAX(B$1:B115)+1,B$1:B115, 1)))","v":""},{"$f":"IF(D116=\"\",\"\",IF(D116<D115,IF(1+INDEX(C:C,MATCH(MAX(C$1:C115)+1,C$1:C115, 1))>12,1,1+INDEX(C:C,MATCH(MAX(C$1:C115)+1,C$1:C115, 1))),\"\"))","v":7},1,"森田　りよ子",{"$f":"IF(E116=\"\",\"\",IF(COUNTIF(E$6:E115,E116)<1,\"初\",IFERROR(VLOOKUP(INDEX(F$1:F115,_xlfn.AGGREGATE(14,6,ROW(E$6:E115)/(E$6:E115=E116),1)),{\"申\",\"　\";\"　\",\"申\"},2,0),\"\")))","v":"　"},"赤松　修",null,null,null,null,null,null,null,"森田 赤松   　"]
[null,{"$f":"IF(C117<>1,\"\",1+INDEX(B:B,MATCH(MAX(B$1:B116)+1,B$1:B116, 1)))","v":""},{"$f":"IF(D117=\"\",\"\",IF(D117<D116,IF(1+INDEX(C:C,MATCH(MAX(C$1:C116)+1,C$1:C116, 1))>12,1,1+INDEX(C:C,MATCH(MAX(C$1:C116)+1,C$1:C116, 1))),\"\"))","v":""},5,"角　　 智美",{"$f":"IF(E117=\"\",\"\",IF(COUNTIF(E$6:E116,E117)<1,\"初\",IFERROR(VLOOKUP(INDEX(F$1:F116,_xlfn.AGGREGATE(14,6,ROW(E$6:E116)/(E$6:E116=E117),1)),{\"申\",\"　\";\"　\",\"申\"},2,0),\"\")))","v":"　"},"友池　明日香",null,null,null,null,null,null,null,"角 友池   　"]
[null,{"$f":"IF(C118<>1,\"\",1+INDEX(B:B,MATCH(MAX(B$1:B117)+1,B$1:B117, 1)))","v":""},{"$f":"IF(D118=\"\",\"\",IF(D118<D117,IF(1+INDEX(C:C,MATCH(MAX(C$1:C117)+1,C$1:C117, 1))>12,1,1+INDEX(C:C,MATCH(MAX(C$1:C117)+1,C$1:C117, 1))),\"\"))","v":""},12,"大淵　倫子","申","白水　恵美子",null,null,null,null,null,null,null,"大淵 白水   申"]
[null,{"$f":"IF(C119<>1,\"\",1+INDEX(B:B,MATCH(MAX(B$1:B118)+1,B$1:B118, 1)))","v":""},{"$f":"IF(D119=\"\",\"\",IF(D119<D118,IF(1+INDEX(C:C,MATCH(MAX(C$1:C118)+1,C$1:C118, 1))>12,1,1+INDEX(C:C,MATCH(MAX(C$1:C118)+1,C$1:C118, 1))),\"\"))","v":""},21,"福満　典子",{"$f":"IF(E119=\"\",\"\",IF(COUNTIF(E$6:E118,E119)<1,\"初\",IFERROR(VLOOKUP(INDEX(F$1:F118,_xlfn.AGGREGATE(14,6,ROW(E$6:E118)/(E$6:E118=E119),1)),{\"申\",\"　\";\"　\",\"申\"},2,0),\"\")))","v":"申"},"友池　明日香",null,null,null,null,null,"【外線】",null,"福満 友池  【外線】 申"]
[null,{"$f":"IF(C120<>1,\"\",1+INDEX(B:B,MATCH(MAX(B$1:B119)+1,B$1:B119, 1)))","v":""},{"$f":"IF(D120=\"\",\"\",IF(D120<D119,IF(1+INDEX(C:C,MATCH(MAX(C$1:C119)+1,C$1:C119, 1))>12,1,1+INDEX(C:C,MATCH(MAX(C$1:C119)+1,C$1:C119, 1))),\"\"))","v":""},28,"角　　 智美",{"$f":"IF(E120=\"\",\"\",IF(COUNTIF(E$6:E119,E120)<1,\"初\",IFERROR(VLOOKUP(INDEX(F$1:F119,_xlfn.AGGREGATE(14,6,ROW(E$6:E119)/(E$6:E119=E120),1)),{\"申\",\"　\";\"　\",\"申\"},2,0),\"\")))","v":"申"},"白水　恵美子",null,null,null,null,null,null,"コロナ","角 白水  コロナ 申"]
[null,{"$f":"IF(C121<>1,\"\",1+INDEX(B:B,MATCH(MAX(B$1:B120)+1,B$1:B120, 1)))","v":""},{"$f":"IF(D121=\"\",\"\",IF(D121<D120,IF(1+INDEX(C:C,MATCH(MAX(C$1:C120)+1,C$1:C120, 1))>12,1,1+INDEX(C:C,MATCH(MAX(C$1:C120)+1,C$1:C120, 1))),\"\"))","v":""},30,"林　　 和重",{"$f":"IF(E121=\"\",\"\",IF(COUNTIF(E$6:E120,E121)<1,\"初\",IFERROR(VLOOKUP(INDEX(F$1:F120,_xlfn.AGGREGATE(14,6,ROW(E$6:E120)/(E$6:E120=E121),1)),{\"申\",\"　\";\"　\",\"申\"},2,0),\"\")))","v":"　"},"林　　 恵理",null,null,null,null,null,null,"コロナ","林 林  コロナ 　"]
[null,{"$f":"IF(C122<>1,\"\",1+INDEX(B:B,MATCH(MAX(B$1:B121)+1,B$1:B121, 1)))","v":""},8,2,"角　　 智美",{"$f":"IF(E122=\"\",\"\",IF(COUNTIF(E$6:E121,E122)<1,\"初\",IFERROR(VLOOKUP(INDEX(F$1:F121,_xlfn.AGGREGATE(14,6,ROW(E$6:E121)/(E$6:E121=E122),1)),{\"申\",\"　\";\"　\",\"申\"},2,0),\"\")))","v":"　"},"林　　 恵理",null,null,null,null,null,null,"コロナ","角 林  コロナ 　"]
[null,{"$f":"IF(C123<>1,\"\",1+INDEX(B:B,MATCH(MAX(B$1:B122)+1,B$1:B122, 1)))","v":""},{"$f":"IF(D123=\"\",\"\",IF(D123<D122,IF(1+INDEX(C:C,MATCH(MAX(C$1:C122)+1,C$1:C122, 1))>12,1,1+INDEX(C:C,MATCH(MAX(C$1:C122)+1,C$1:C122, 1))),\"\"))","v":""},13,"斉藤　京子",{"$f":"IF(E123=\"\",\"\",IF(COUNTIF(E$6:E122,E123)<1,\"初\",IFERROR(VLOOKUP(INDEX(F$1:F122,_xlfn.AGGREGATE(14,6,ROW(E$6:E122)/(E$6:E122=E123),1)),{\"申\",\"　\";\"　\",\"申\"},2,0),\"\")))","v":"申"},"白水　恵美子",null,null,null,null,null,null,null,"斉藤 白水   申"]
[null,{"$f":"IF(C124<>1,\"\",1+INDEX(B:B,MATCH(MAX(B$1:B123)+1,B$1:B123, 1)))","v":""},{"$f":"IF(D124=\"\",\"\",IF(D124<D123,IF(1+INDEX(C:C,MATCH(MAX(C$1:C123)+1,C$1:C123, 1))>12,1,1+INDEX(C:C,MATCH(MAX(C$1:C123)+1,C$1:C123, 1))),\"\"))","v":""},20,"角　　 智美",{"$f":"IF(E124=\"\",\"\",IF(COUNTIF(E$6:E123,E124)<1,\"初\",IFERROR(VLOOKUP(INDEX(F$1:F123,_xlfn.AGGREGATE(14,6,ROW(E$6:E123)/(E$6:E123=E124),1)),{\"申\",\"　\";\"　\",\"申\"},2,0),\"\")))","v":"申"},"友池　明日香",null,null,null,null,null,null,null,"角 友池   申"]
[null,{"$f":"IF(C125<>1,\"\",1+INDEX(B:B,MATCH(MAX(B$1:B124)+1,B$1:B124, 1)))","v":""},{"$f":"IF(D125=\"\",\"\",IF(D125<D124,IF(1+INDEX(C:C,MATCH(MAX(C$1:C124)+1,C$1:C124, 1))>12,1,1+INDEX(C:C,MATCH(MAX(C$1:C124)+1,C$1:C124, 1))),\"\"))","v":""},25,"斉藤　京子","申","友池　明日香",null,null,null,null,null,null,null,"斉藤 友池   申"]
[null,{"$f":"IF(C126<>1,\"\",1+INDEX(B:B,MATCH(MAX(B$1:B125)+1,B$1:B125, 1)))","v":""},{"$f":"IF(D126=\"\",\"\",IF(D126<D125,IF(1+INDEX(C:C,MATCH(MAX(C$1:C125)+1,C$1:C125, 1))>12,1,1+INDEX(C:C,MATCH(MAX(C$1:C125)+1,C$1:C125, 1))),\"\"))","v":9},1,"角　　 智美","申","工藤　里美",null,null,null,null,null,null,null,"角 工藤   申"]
[null,{"$f":"IF(C127<>1,\"\",1+INDEX(B:B,MATCH(MAX(B$1:B126)+1,B$1:B126, 1)))","v":""},{"$f":"IF(D127=\"\",\"\",IF(D127<D126,IF(1+INDEX(C:C,MATCH(MAX(C$1:C126)+1,C$1:C126, 1))>12,1,1+INDEX(C:C,MATCH(MAX(C$1:C126)+1,C$1:C126, 1))),\"\"))","v":""},7,"斉藤　京子",{"$f":"IF(E127=\"\",\"\",IF(COUNTIF(E$6:E126,E127)<1,\"初\",IFERROR(VLOOKUP(INDEX(F$1:F126,_xlfn.AGGREGATE(14,6,ROW(E$6:E126)/(E$6:E126=E127),1)),{\"申\",\"　\";\"　\",\"申\"},2,0),\"\")))","v":"　"},"白水　恵美子",null,null,null,null,null,null,null,"斉藤 白水   　"]
[null,{"$f":"IF(C128<>1,\"\",1+INDEX(B:B,MATCH(MAX(B$1:B127)+1,B$1:B127, 1)))","v":""},{"$f":"IF(D128=\"\",\"\",IF(D128<D127,IF(1+INDEX(C:C,MATCH(MAX(C$1:C127)+1,C$1:C127, 1))>12,1,1+INDEX(C:C,MATCH(MAX(C$1:C127)+1,C$1:C127, 1))),\"\"))","v":""},13,"森田　りよ子",{"$f":"IF(E128=\"\",\"\",IF(COUNTIF(E$6:E127,E128)<1,\"初\",IFERROR(VLOOKUP(INDEX(F$1:F127,_xlfn.AGGREGATE(14,6,ROW(E$6:E127)/(E$6:E127=E128),1)),{\"申\",\"　\";\"　\",\"申\"},2,0),\"\")))","v":"申"},"赤松　修",null,null,null,null,null,"【外線】",null,"森田 赤松  【外線】 申"]
[null,{"$f":"IF(C129<>1,\"\",1+INDEX(B:B,MATCH(MAX(B$1:B128)+1,B$1:B128, 1)))","v":""},{"$f":"IF(D129=\"\",\"\",IF(D129<D128,IF(1+INDEX(C:C,MATCH(MAX(C$1:C128)+1,C$1:C128, 1))>12,1,1+INDEX(C:C,MATCH(MAX(C$1:C128)+1,C$1:C128, 1))),\"\"))","v":""},18,"田中　ゆかり","　","友池　明日香",null,null,null,null,null,"【外線】",null,"田中 友池  【外線】 　"]
[null,{"$f":"IF(C130<>1,\"\",1+INDEX(B:B,MATCH(MAX(B$1:B129)+1,B$1:B129, 1)))","v":""},{"$f":"IF(D130=\"\",\"\",IF(D130<D129,IF(1+INDEX(C:C,MATCH(MAX(C$1:C129)+1,C$1:C129, 1))>12,1,1+INDEX(C:C,MATCH(MAX(C$1:C129)+1,C$1:C129, 1))),\"\"))","v":""},27,"角　　 智美",{"$f":"IF(E130=\"\",\"\",IF(COUNTIF(E$6:E129,E130)<1,\"初\",IFERROR(VLOOKUP(INDEX(F$1:F129,_xlfn.AGGREGATE(14,6,ROW(E$6:E129)/(E$6:E129=E130),1)),{\"申\",\"　\";\"　\",\"申\"},2,0),\"\")))","v":"　"},"工藤　里美",null,null,null,null,null,null,null,"角 工藤   　"]
[null,{"$f":"IF(C131<>1,\"\",1+INDEX(B:B,MATCH(MAX(B$1:B130)+1,B$1:B130, 1)))","v":""},{"$f":"IF(D131=\"\",\"\",IF(D131<D130,IF(1+INDEX(C:C,MATCH(MAX(C$1:C130)+1,C$1:C130, 1))>12,1,1+INDEX(C:C,MATCH(MAX(C$1:C130)+1,C$1:C130, 1))),\"\"))","v":10},2,"田中　ゆかり",{"$f":"IF(E131=\"\",\"\",IF(COUNTIF(E$6:E130,E131)<1,\"初\",IFERROR(VLOOKUP(INDEX(F$1:F130,_xlfn.AGGREGATE(14,6,ROW(E$6:E130)/(E$6:E130=E131),1)),{\"申\",\"　\";\"　\",\"申\"},2,0),\"\")))","v":"申"},"工藤　里美",null,null,null,null,null,null,null,"田中 工藤   申"]
[null,{"$f":"IF(C132<>1,\"\",1+INDEX(B:B,MATCH(MAX(B$1:B131)+1,B$1:B131, 1)))","v":""},{"$f":"IF(D132=\"\",\"\",IF(D132<D131,IF(1+INDEX(C:C,MATCH(MAX(C$1:C131)+1,C$1:C131, 1))>12,1,1+INDEX(C:C,MATCH(MAX(C$1:C131)+1,C$1:C131, 1))),\"\"))","v":""},7,"大淵　倫子","申","白水　恵美子",null,null,null,null,null,null,null,"大淵 白水   申"]
[null,{"$f":"IF(C133<>1,\"\",1+INDEX(B:B,MATCH(MAX(B$1:B132)+1,B$1:B132, 1)))","v":""},{"$f":"IF(D133=\"\",\"\",IF(D133<D132,IF(1+INDEX(C:C,MATCH(MAX(C$1:C132)+1,C$1:C132, 1))>12,1,1+INDEX(C:C,MATCH(MAX(C$1:C132)+1,C$1:C132, 1))),\"\"))","v":""},15,"角　　 智美",{"$f":"IF(E133=\"\",\"\",IF(COUNTIF(E$6:E132,E133)<1,\"初\",IFERROR(VLOOKUP(INDEX(F$1:F132,_xlfn.AGGREGATE(14,6,ROW(E$6:E132)/(E$6:E132=E133),1)),{\"申\",\"　\";\"　\",\"申\"},2,0),\"\")))","v":"申"},"友池　明日香","院長",null,null,"木村Dr（耳）",null,"【外線】",null,"角 友池 木村Dr（耳） 院長【外線】 申"]
[null,{"$f":"IF(C134<>1,\"\",1+INDEX(B:B,MATCH(MAX(B$1:B133)+1,B$1:B133, 1)))","v":""},{"$f":"IF(D134=\"\",\"\",IF(D134<D133,IF(1+INDEX(C:C,MATCH(MAX(C$1:C133)+1,C$1:C133, 1))>12,1,1+INDEX(C:C,MATCH(MAX(C$1:C133)+1,C$1:C133, 1))),\"\"))","v":""},21,"角　　 智美","申","赤松　修",null,null,null,null,null,null,null,"角 赤松   申"]
[null,{"$f":"IF(C135<>1,\"\",1+INDEX(B:B,MATCH(MAX(B$1:B134)+1,B$1:B134, 1)))","v":""},{"$f":"IF(D135=\"\",\"\",IF(D135<D134,IF(1+INDEX(C:C,MATCH(MAX(C$1:C134)+1,C$1:C134, 1))>12,1,1+INDEX(C:C,MATCH(MAX(C$1:C134)+1,C$1:C134, 1))),\"\"))","v":""},27,"斉藤　京子",{"$f":"IF(E135=\"\",\"\",IF(COUNTIF(E$6:E134,E135)<1,\"初\",IFERROR(VLOOKUP(INDEX(F$1:F134,_xlfn.AGGREGATE(14,6,ROW(E$6:E134)/(E$6:E134=E135),1)),{\"申\",\"　\";\"　\",\"申\"},2,0),\"\")))","v":"申"},"白水　恵美子",null,null,null,null,null,null,null,"斉藤 白水   申"]
[null,{"$f":"IF(C136<>1,\"\",1+INDEX(B:B,MATCH(MAX(B$1:B135)+1,B$1:B135, 1)))","v":""},{"$f":"IF(D136=\"\",\"\",IF(D136<D135,IF(1+INDEX(C:C,MATCH(MAX(C$1:C135)+1,C$1:C135, 1))>12,1,1+INDEX(C:C,MATCH(MAX(C$1:C135)+1,C$1:C135, 1))),\"\"))","v":11},1,"大淵　倫子","申","白水　恵美子",null,null,null,null,null,null,null,"大淵 白水   申"]
[null,{"$f":"IF(C137<>1,\"\",1+INDEX(B:B,MATCH(MAX(B$1:B136)+1,B$1:B136, 1)))","v":""},{"$f":"IF(D137=\"\",\"\",IF(D137<D136,IF(1+INDEX(C:C,MATCH(MAX(C$1:C136)+1,C$1:C136, 1))>12,1,1+INDEX(C:C,MATCH(MAX(C$1:C136)+1,C$1:C136, 1))),\"\"))","v":""},7,"斉藤　京子",{"$f":"IF(E137=\"\",\"\",IF(COUNTIF(E$6:E136,E137)<1,\"初\",IFERROR(VLOOKUP(INDEX(F$1:F136,_xlfn.AGGREGATE(14,6,ROW(E$6:E136)/(E$6:E136=E137),1)),{\"申\",\"　\";\"　\",\"申\"},2,0),\"\")))","v":"　"},"林　　 恵理",null,null,null,null,null,"【外線】",null,"斉藤 林  【外線】 　"]
[null,{"$f":"IF(C138<>1,\"\",1+INDEX(B:B,MATCH(MAX(B$1:B137)+1,B$1:B137, 1)))","v":""},{"$f":"IF(D138=\"\",\"\",IF(D138<D137,IF(1+INDEX(C:C,MATCH(MAX(C$1:C137)+1,C$1:C137, 1))>12,1,1+INDEX(C:C,MATCH(MAX(C$1:C137)+1,C$1:C137, 1))),\"\"))","v":""},12,"柴田　由美",{"$f":"IF(E138=\"\",\"\",IF(COUNTIF(E$6:E137,E138)<1,\"初\",IFERROR(VLOOKUP(INDEX(F$1:F137,_xlfn.AGGREGATE(14,6,ROW(E$6:E137)/(E$6:E137=E138),1)),{\"申\",\"　\";\"　\",\"申\"},2,0),\"\")))","v":"申"},"林　　 恵理",null,null,null,null,null,"【外線】",null,"柴田 林  【外線】 申"]
[null,{"$f":"IF(C139<>1,\"\",1+INDEX(B:B,MATCH(MAX(B$1:B138)+1,B$1:B138, 1)))","v":""},{"$f":"IF(D139=\"\",\"\",IF(D139<D138,IF(1+INDEX(C:C,MATCH(MAX(C$1:C138)+1,C$1:C138, 1))>12,1,1+INDEX(C:C,MATCH(MAX(C$1:C138)+1,C$1:C138, 1))),\"\"))","v":""},19,"斉藤　京子",{"$f":"IF(E139=\"\",\"\",IF(COUNTIF(E$6:E138,E139)<1,\"初\",IFERROR(VLOOKUP(INDEX(F$1:F138,_xlfn.AGGREGATE(14,6,ROW(E$6:E138)/(E$6:E138=E139),1)),{\"申\",\"　\";\"　\",\"申\"},2,0),\"\")))","v":"申"},"赤松　修",null,null,null,null,null,null,null,"斉藤 赤松   申"]
[null,{"$f":"IF(C140<>1,\"\",1+INDEX(B:B,MATCH(MAX(B$1:B139)+1,B$1:B139, 1)))","v":""},{"$f":"IF(D140=\"\",\"\",IF(D140<D139,IF(1+INDEX(C:C,MATCH(MAX(C$1:C139)+1,C$1:C139, 1))>12,1,1+INDEX(C:C,MATCH(MAX(C$1:C139)+1,C$1:C139, 1))),\"\"))","v":""},30,"角　　 智美","申","工藤　里美",null,null,null,null,null,null,null,"角 工藤   申"]
[null,{"$f":"IF(C141<>1,\"\",1+INDEX(B:B,MATCH(MAX(B$1:B140)+1,B$1:B140, 1)))","v":""},{"$f":"IF(D141=\"\",\"\",IF(D141<D140,IF(1+INDEX(C:C,MATCH(MAX(C$1:C140)+1,C$1:C140, 1))>12,1,1+INDEX(C:C,MATCH(MAX(C$1:C140)+1,C$1:C140, 1))),\"\"))","v":12},3,"斉藤　京子",{"$f":"IF(E141=\"\",\"\",IF(COUNTIF(E$6:E140,E141)<1,\"初\",IFERROR(VLOOKUP(INDEX(F$1:F140,_xlfn.AGGREGATE(14,6,ROW(E$6:E140)/(E$6:E140=E141),1)),{\"申\",\"　\";\"　\",\"申\"},2,0),\"\")))","v":"　"},"赤松　修",null,null,null,null,null,null,null,"斉藤 赤松   　"]
[null,{"$f":"IF(C142<>1,\"\",1+INDEX(B:B,MATCH(MAX(B$1:B141)+1,B$1:B141, 1)))","v":""},{"$f":"IF(D142=\"\",\"\",IF(D142<D141,IF(1+INDEX(C:C,MATCH(MAX(C$1:C141)+1,C$1:C141, 1))>12,1,1+INDEX(C:C,MATCH(MAX(C$1:C141)+1,C$1:C141, 1))),\"\"))","v":""},8,"大淵　倫子","申","白水　恵美子","松岡",null,null,"浪花Ｄｒ","(精)","【外線】",null,"大淵 白水 浪花Ｄｒ(精) 松岡【外線】 申"]
[null,{"$f":"IF(C143<>1,\"\",1+INDEX(B:B,MATCH(MAX(B$1:B142)+1,B$1:B142, 1)))","v":""},{"$f":"IF(D143=\"\",\"\",IF(D143<D142,IF(1+INDEX(C:C,MATCH(MAX(C$1:C142)+1,C$1:C142, 1))>12,1,1+INDEX(C:C,MATCH(MAX(C$1:C142)+1,C$1:C142, 1))),\"\"))","v":""},17,"柴田　由美",{"$f":"IF(E143=\"\",\"\",IF(COUNTIF(E$6:E142,E143)<1,\"初\",IFERROR(VLOOKUP(INDEX(F$1:F142,_xlfn.AGGREGATE(14,6,ROW(E$6:E142)/(E$6:E142=E143),1)),{\"申\",\"　\";\"　\",\"申\"},2,0),\"\")))","v":"　"},"赤松　修",null,null,null,null,null,null,null,"柴田 赤松   　"]
[null,{"$f":"IF(C144<>1,\"\",1+INDEX(B:B,MATCH(MAX(B$1:B143)+1,B$1:B143, 1)))","v":""},{"$f":"IF(D144=\"\",\"\",IF(D144<D143,IF(1+INDEX(C:C,MATCH(MAX(C$1:C143)+1,C$1:C143, 1))>12,1,1+INDEX(C:C,MATCH(MAX(C$1:C143)+1,C$1:C143, 1))),\"\"))","v":""},24,"柴田　由美",{"$f":"IF(E144=\"\",\"\",IF(COUNTIF(E$6:E143,E144)<1,\"初\",IFERROR(VLOOKUP(INDEX(F$1:F143,_xlfn.AGGREGATE(14,6,ROW(E$6:E143)/(E$6:E143=E144),1)),{\"申\",\"　\";\"　\",\"申\"},2,0),\"\")))","v":"申"},"林　　 恵理",null,null,null,null,null,null,null,"柴田 林   申"]
[null,{"$f":"IF(C145<>1,\"\",1+INDEX(B:B,MATCH(MAX(B$1:B144)+1,B$1:B144, 1)))","v":""},{"$f":"IF(D145=\"\",\"\",IF(D145<D144,IF(1+INDEX(C:C,MATCH(MAX(C$1:C144)+1,C$1:C144, 1))>12,1,1+INDEX(C:C,MATCH(MAX(C$1:C144)+1,C$1:C144, 1))),\"\"))","v":""},27,"大淵　倫子","申","友池　明日香",null,null,null,null,null,null,null,"大淵 友池   申"]
[null,{"$f":"IF(C146<>1,\"\",1+INDEX(B:B,MATCH(MAX(B$1:B145)+1,B$1:B145, 1)))","v":""},{"$f":"IF(D146=\"\",\"\",IF(D146<D145,IF(1+INDEX(C:C,MATCH(MAX(C$1:C145)+1,C$1:C145, 1))>12,1,1+INDEX(C:C,MATCH(MAX(C$1:C145)+1,C$1:C145, 1))),\"\"))","v":""},31,"古賀　美奈子",{"$f":"IF(E146=\"\",\"\",IF(COUNTIF(E$6:E145,E146)<1,\"初\",IFERROR(VLOOKUP(INDEX(F$1:F145,_xlfn.AGGREGATE(14,6,ROW(E$6:E145)/(E$6:E145=E146),1)),{\"申\",\"　\";\"　\",\"申\"},2,0),\"\")))","v":"初"},"赤松　修",null,null,null,null,null,null,null,"古賀 赤松   初"]
[null,{"$f":"IF(C147<>1,\"\",1+INDEX(B:B,MATCH(MAX(B$1:B146)+1,B$1:B146, 1)))","v":""},{"$f":"IF(D147=\"\",\"\",IF(D147<D146,IF(1+INDEX(C:C,MATCH(MAX(C$1:C146)+1,C$1:C146, 1))>12,1,1+INDEX(C:C,MATCH(MAX(C$1:C146)+1,C$1:C146, 1))),\"\"))","v":""},null,null,{"$f":"IF(E147=\"\",\"\",IF(COUNTIF(E$6:E146,E147)<1,\"初\",IFERROR(VLOOKUP(INDEX(F$1:F146,_xlfn.AGGREGATE(14,6,ROW(E$6:E146)/(E$6:E146=E147),1)),{\"申\",\"　\";\"　\",\"申\"},2,0),\"\")))","v":""},null,null,null,null,null,null,null,null," "]
[null,{"$f":"IF(C148<>1,\"\",1+INDEX(B:B,MATCH(MAX(B$1:B147)+1,B$1:B147, 1)))","v":""},{"$f":"IF(D148=\"\",\"\",IF(D148<D147,IF(1+INDEX(C:C,MATCH(MAX(C$1:C147)+1,C$1:C147, 1))>12,1,1+INDEX(C:C,MATCH(MAX(C$1:C147)+1,C$1:C147, 1))),\"\"))","v":""},null,null,{"$f":"IF(E148=\"\",\"\",IF(COUNTIF(E$6:E147,E148)<1,\"初\",IFERROR(VLOOKUP(INDEX(F$1:F147,_xlfn.AGGREGATE(14,6,ROW(E$6:E147)/(E$6:E147=E148),1)),{\"申\",\"　\";\"　\",\"申\"},2,0),\"\")))","v":""},null,null,null,null,null,null,null,null," "]
[null,{"$f":"IF(C149<>1,\"\",1+INDEX(B:B,MATCH(MAX(B$1:B148)+1,B$1:B148, 1)))","v":""},{"$f":"IF(D149=\"\",\"\",IF(D149<D148,IF(1+INDEX(C:C,MATCH(MAX(C$1:C148)+1,C$1:C148, 1))>12,1,1+INDEX(C:C,MATCH(MAX(C$1:C148)+1,C$1:C148, 1))),\"\"))","v":""},null,null,{"$f":"IF(E149=\"\",\"\",IF(COUNTIF(E$6:E148,E149)<1,\"初\",IFERROR(VLOOKUP(INDEX(F$1:F148,_xlfn.AGGREGATE(14,6,ROW(E$6:E148)/(E$6:E148=E149),1)),{\"申\",\"　\";\"　\",\"申\"},2,0),\"\")))","v":""},null,null,null,null,null,null,null,null," "]
[null,{"$f":"IF(C150<>1,\"\",1+INDEX(B:B,MATCH(MAX(B$1:B149)+1,B$1:B149, 1)))","v":""},{"$f":"IF(D150=\"\",\"\",IF(D150<D149,IF(1+INDEX(C:C,MATCH(MAX(C$1:C149)+1,C$1:C149, 1))>12,1,1+INDEX(C:C,MATCH(MAX(C$1:C149)+1,C$1:C149, 1))),\"\"))","v":""},null,null,{"$f":"IF(E150=\"\",\"\",IF(COUNTIF(E$6:E149,E150)<1,\"初\",IFERROR(VLOOKUP(INDEX(F$1:F149,_xlfn.AGGREGATE(14,6,ROW(E$6:E149)/(E$6:E149=E150),1)),{\"申\",\"　\";\"　\",\"申\"},2,0),\"\")))","v":""},null,null,null,null,null,null,null,null," "]
[null,{"$f":"IF(C151<>1,\"\",1+INDEX(B:B,MATCH(MAX(B$1:B150)+1,B$1:B150, 1)))","v":""},{"$f":"IF(D151=\"\",\"\",IF(D151<D150,IF(1+INDEX(C:C,MATCH(MAX(C$1:C150)+1,C$1:C150, 1))>12,1,1+INDEX(C:C,MATCH(MAX(C$1:C150)+1,C$1:C150, 1))),\"\"))","v":""},null,null,{"$f":"IF(E151=\"\",\"\",IF(COUNTIF(E$6:E150,E151)<1,\"初\",IFERROR(VLOOKUP(INDEX(F$1:F150,_xlfn.AGGREGATE(14,6,ROW(E$6:E150)/(E$6:E150=E151),1)),{\"申\",\"　\";\"　\",\"申\"},2,0),\"\")))","v":""},null,null,null,null,null,null,null,null," "]
[null,{"$f":"IF(C152<>1,\"\",1+INDEX(B:B,MATCH(MAX(B$1:B151)+1,B$1:B151, 1)))","v":""},{"$f":"IF(D152=\"\",\"\",IF(D152<D151,IF(1+INDEX(C:C,MATCH(MAX(C$1:C151)+1,C$1:C151, 1))>12,1,1+INDEX(C:C,MATCH(MAX(C$1:C151)+1,C$1:C151, 1))),\"\"))","v":""},null,null,{"$f":"IF(E152=\"\",\"\",IF(COUNTIF(E$6:E151,E152)<1,\"初\",IFERROR(VLOOKUP(INDEX(F$1:F151,_xlfn.AGGREGATE(14,6,ROW(E$6:E151)/(E$6:E151=E152),1)),{\"申\",\"　\";\"　\",\"申\"},2,0),\"\")))","v":""},null,null,null,null,null,null,null,null," "]
[null,{"$f":"IF(C153<>1,\"\",1+INDEX(B:B,MATCH(MAX(B$1:B152)+1,B$1:B152, 1)))","v":""},{"$f":"IF(D153=\"\",\"\",IF(D153<D152,IF(1+INDEX(C:C,MATCH(MAX(C$1:C152)+1,C$1:C152, 1))>12,1,1+INDEX(C:C,MATCH(MAX(C$1:C152)+1,C$1:C152, 1))),\"\"))","v":""},null,null,{"$f":"IF(E153=\"\",\"\",IF(COUNTIF(E$6:E152,E153)<1,\"初\",IFERROR(VLOOKUP(INDEX(F$1:F152,_xlfn.AGGREGATE(14,6,ROW(E$6:E152)/(E$6:E152=E153),1)),{\"申\",\"　\";\"　\",\"申\"},2,0),\"\")))","v":""},null,null,null,null,null,null,null,null," "]
[null,{"$f":"IF(C154<>1,\"\",1+INDEX(B:B,MATCH(MAX(B$1:B153)+1,B$1:B153, 1)))","v":""},{"$f":"IF(D154=\"\",\"\",IF(D154<D153,IF(1+INDEX(C:C,MATCH(MAX(C$1:C153)+1,C$1:C153, 1))>12,1,1+INDEX(C:C,MATCH(MAX(C$1:C153)+1,C$1:C153, 1))),\"\"))","v":""},null,null,{"$f":"IF(E154=\"\",\"\",IF(COUNTIF(E$6:E153,E154)<1,\"初\",IFERROR(VLOOKUP(INDEX(F$1:F153,_xlfn.AGGREGATE(14,6,ROW(E$6:E153)/(E$6:E153=E154),1)),{\"申\",\"　\";\"　\",\"申\"},2,0),\"\")))","v":""},null,null,null,null,null,null,null,null," "]
[null,{"$f":"IF(C155<>1,\"\",1+INDEX(B:B,MATCH(MAX(B$1:B154)+1,B$1:B154, 1)))","v":""},{"$f":"IF(D155=\"\",\"\",IF(D155<D154,IF(1+INDEX(C:C,MATCH(MAX(C$1:C154)+1,C$1:C154, 1))>12,1,1+INDEX(C:C,MATCH(MAX(C$1:C154)+1,C$1:C154, 1))),\"\"))","v":""},null,null,{"$f":"IF(E155=\"\",\"\",IF(COUNTIF(E$6:E154,E155)<1,\"初\",IFERROR(VLOOKUP(INDEX(F$1:F154,_xlfn.AGGREGATE(14,6,ROW(E$6:E154)/(E$6:E154=E155),1)),{\"申\",\"　\";\"　\",\"申\"},2,0),\"\")))","v":""},null,null,null,null,null,null,null,null," "]
[null,{"$f":"IF(C156<>1,\"\",1+INDEX(B:B,MATCH(MAX(B$1:B155)+1,B$1:B155, 1)))","v":""},{"$f":"IF(D156=\"\",\"\",IF(D156<D155,IF(1+INDEX(C:C,MATCH(MAX(C$1:C155)+1,C$1:C155, 1))>12,1,1+INDEX(C:C,MATCH(MAX(C$1:C155)+1,C$1:C155, 1))),\"\"))","v":""},null,null,{"$f":"IF(E156=\"\",\"\",IF(COUNTIF(E$6:E155,E156)<1,\"初\",IFERROR(VLOOKUP(INDEX(F$1:F155,_xlfn.AGGREGATE(14,6,ROW(E$6:E155)/(E$6:E155=E156),1)),{\"申\",\"　\";\"　\",\"申\"},2,0),\"\")))","v":""},null,null,null,null,null,null,null,null," "]
[null,{"$f":"IF(C157<>1,\"\",1+INDEX(B:B,MATCH(MAX(B$1:B156)+1,B$1:B156, 1)))","v":""},{"$f":"IF(D157=\"\",\"\",IF(D157<D156,IF(1+INDEX(C:C,MATCH(MAX(C$1:C156)+1,C$1:C156, 1))>12,1,1+INDEX(C:C,MATCH(MAX(C$1:C156)+1,C$1:C156, 1))),\"\"))","v":""},null,null,{"$f":"IF(E157=\"\",\"\",IF(COUNTIF(E$6:E156,E157)<1,\"初\",IFERROR(VLOOKUP(INDEX(F$1:F156,_xlfn.AGGREGATE(14,6,ROW(E$6:E156)/(E$6:E156=E157),1)),{\"申\",\"　\";\"　\",\"申\"},2,0),\"\")))","v":""},null,null,null,null,null,null,null,null," "]
[null,{"$f":"IF(C158<>1,\"\",1+INDEX(B:B,MATCH(MAX(B$1:B157)+1,B$1:B157, 1)))","v":""},{"$f":"IF(D158=\"\",\"\",IF(D158<D157,IF(1+INDEX(C:C,MATCH(MAX(C$1:C157)+1,C$1:C157, 1))>12,1,1+INDEX(C:C,MATCH(MAX(C$1:C157)+1,C$1:C157, 1))),\"\"))","v":""},null,null,{"$f":"IF(E158=\"\",\"\",IF(COUNTIF(E$6:E157,E158)<1,\"初\",IFERROR(VLOOKUP(INDEX(F$1:F157,_xlfn.AGGREGATE(14,6,ROW(E$6:E157)/(E$6:E157=E158),1)),{\"申\",\"　\";\"　\",\"申\"},2,0),\"\")))","v":""},null,null,null,null,null,null,null,null," "]
[null,{"$f":"IF(C159<>1,\"\",1+INDEX(B:B,MATCH(MAX(B$1:B158)+1,B$1:B158, 1)))","v":""},{"$f":"IF(D159=\"\",\"\",IF(D159<D158,IF(1+INDEX(C:C,MATCH(MAX(C$1:C158)+1,C$1:C158, 1))>12,1,1+INDEX(C:C,MATCH(MAX(C$1:C158)+1,C$1:C158, 1))),\"\"))","v":""},null,null,{"$f":"IF(E159=\"\",\"\",IF(COUNTIF(E$6:E158,E159)<1,\"初\",IFERROR(VLOOKUP(INDEX(F$1:F158,_xlfn.AGGREGATE(14,6,ROW(E$6:E158)/(E$6:E158=E159),1)),{\"申\",\"　\";\"　\",\"申\"},2,0),\"\")))","v":""},null,null,null,null,null,null,null,null,{"$f":"IF(ISERROR(LEFT(E159,FIND(\"　\",E159,1)-1)&\" \"&LEFT(G159,FIND(\"　\",G159,1)-1)&\" \"&K159&L159&\" \"&H159&IF(I159<>\"\",\"or\"&I159,\"\")&J159&M159&N159), \"\", LEFT(E159,FIND(\"　\",E159,1)-1)&\" \"&LEFT(G159,FIND(\"　\",G159,1)-1)&\" \"&K159&L159&\" \"&H159&IF(I159<>\"\",\"or\"&I159,\"\")&J159&M159&N159)&\" \"&F159","v":" "}]
[null,{"$f":"IF(C160<>1,\"\",1+INDEX(B:B,MATCH(MAX(B$1:B159)+1,B$1:B159, 1)))","v":""},{"$f":"IF(D160=\"\",\"\",IF(D160<D159,IF(1+INDEX(C:C,MATCH(MAX(C$1:C159)+1,C$1:C159, 1))>12,1,1+INDEX(C:C,MATCH(MAX(C$1:C159)+1,C$1:C159, 1))),\"\"))","v":""},null,null,{"$f":"IF(E160=\"\",\"\",IF(COUNTIF(E$6:E159,E160)<1,\"初\",IFERROR(VLOOKUP(INDEX(F$1:F159,_xlfn.AGGREGATE(14,6,ROW(E$6:E159)/(E$6:E159=E160),1)),{\"申\",\"　\";\"　\",\"申\"},2,0),\"\")))","v":""},null,null,null,null,null,null,null,null," "]
[null,{"$f":"IF(C161<>1,\"\",1+INDEX(B:B,MATCH(MAX(B$1:B160)+1,B$1:B160, 1)))","v":""},{"$f":"IF(D161=\"\",\"\",IF(D161<D160,IF(1+INDEX(C:C,MATCH(MAX(C$1:C160)+1,C$1:C160, 1))>12,1,1+INDEX(C:C,MATCH(MAX(C$1:C160)+1,C$1:C160, 1))),\"\"))","v":""},null,null,{"$f":"IF(E161=\"\",\"\",IF(COUNTIF(E$6:E160,E161)<1,\"初\",IFERROR(VLOOKUP(INDEX(F$1:F160,_xlfn.AGGREGATE(14,6,ROW(E$6:E160)/(E$6:E160=E161),1)),{\"申\",\"　\";\"　\",\"申\"},2,0),\"\")))","v":""},null,null,null,null,null,null,null,null," "]
[null,{"$f":"IF(C162<>1,\"\",1+INDEX(B:B,MATCH(MAX(B$1:B161)+1,B$1:B161, 1)))","v":""},{"$f":"IF(D162=\"\",\"\",IF(D162<D161,IF(1+INDEX(C:C,MATCH(MAX(C$1:C161)+1,C$1:C161, 1))>12,1,1+INDEX(C:C,MATCH(MAX(C$1:C161)+1,C$1:C161, 1))),\"\"))","v":""},null,null,{"$f":"IF(E162=\"\",\"\",IF(COUNTIF(E$6:E161,E162)<1,\"初\",IFERROR(VLOOKUP(INDEX(F$1:F161,_xlfn.AGGREGATE(14,6,ROW(E$6:E161)/(E$6:E161=E162),1)),{\"申\",\"　\";\"　\",\"申\"},2,0),\"\")))","v":""},null,null,null,null,null,null,null,null," "]
[null,{"$f":"IF(C163<>1,\"\",1+INDEX(B:B,MATCH(MAX(B$1:B162)+1,B$1:B162, 1)))","v":""},{"$f":"IF(D163=\"\",\"\",IF(D163<D162,IF(1+INDEX(C:C,MATCH(MAX(C$1:C162)+1,C$1:C162, 1))>12,1,1+INDEX(C:C,MATCH(MAX(C$1:C162)+1,C$1:C162, 1))),\"\"))","v":""},null,null,{"$f":"IF(E163=\"\",\"\",IF(COUNTIF(E$6:E162,E163)<1,\"初\",IFERROR(VLOOKUP(INDEX(F$1:F162,_xlfn.AGGREGATE(14,6,ROW(E$6:E162)/(E$6:E162=E163),1)),{\"申\",\"　\";\"　\",\"申\"},2,0),\"\")))","v":""},null,null,null,null,null,null,null,null," "]
[null,{"$f":"IF(C164<>1,\"\",1+INDEX(B:B,MATCH(MAX(B$1:B163)+1,B$1:B163, 1)))","v":""},{"$f":"IF(D164=\"\",\"\",IF(D164<D163,IF(1+INDEX(C:C,MATCH(MAX(C$1:C163)+1,C$1:C163, 1))>12,1,1+INDEX(C:C,MATCH(MAX(C$1:C163)+1,C$1:C163, 1))),\"\"))","v":""},null,null,{"$f":"IF(E164=\"\",\"\",IF(COUNTIF(E$6:E163,E164)<1,\"初\",IFERROR(VLOOKUP(INDEX(F$1:F163,_xlfn.AGGREGATE(14,6,ROW(E$6:E163)/(E$6:E163=E164),1)),{\"申\",\"　\";\"　\",\"申\"},2,0),\"\")))","v":""},null,null,null,null,null,null,null,null," "]
[null,{"$f":"IF(C165<>1,\"\",1+INDEX(B:B,MATCH(MAX(B$1:B164)+1,B$1:B164, 1)))","v":""},{"$f":"IF(D165=\"\",\"\",IF(D165<D164,IF(1+INDEX(C:C,MATCH(MAX(C$1:C164)+1,C$1:C164, 1))>12,1,1+INDEX(C:C,MATCH(MAX(C$1:C164)+1,C$1:C164, 1))),\"\"))","v":""},null,null,{"$f":"IF(E165=\"\",\"\",IF(COUNTIF(E$6:E164,E165)<1,\"初\",IFERROR(VLOOKUP(INDEX(F$1:F164,_xlfn.AGGREGATE(14,6,ROW(E$6:E164)/(E$6:E164=E165),1)),{\"申\",\"　\";\"　\",\"申\"},2,0),\"\")))","v":""},null,null,null,null,null,null,null,null," "]
[null,{"$f":"IF(C166<>1,\"\",1+INDEX(B:B,MATCH(MAX(B$1:B165)+1,B$1:B165, 1)))","v":""},{"$f":"IF(D166=\"\",\"\",IF(D166<D165,IF(1+INDEX(C:C,MATCH(MAX(C$1:C165)+1,C$1:C165, 1))>12,1,1+INDEX(C:C,MATCH(MAX(C$1:C165)+1,C$1:C165, 1))),\"\"))","v":""},null,null,{"$f":"IF(E166=\"\",\"\",IF(COUNTIF(E$6:E165,E166)<1,\"初\",IFERROR(VLOOKUP(INDEX(F$1:F165,_xlfn.AGGREGATE(14,6,ROW(E$6:E165)/(E$6:E165=E166),1)),{\"申\",\"　\";\"　\",\"申\"},2,0),\"\")))","v":""},null,null,null,null,null,null,null,null," "]
[null,{"$f":"IF(C167<>1,\"\",1+INDEX(B:B,MATCH(MAX(B$1:B166)+1,B$1:B166, 1)))","v":""},{"$f":"IF(D167=\"\",\"\",IF(D167<D166,IF(1+INDEX(C:C,MATCH(MAX(C$1:C166)+1,C$1:C166, 1))>12,1,1+INDEX(C:C,MATCH(MAX(C$1:C166)+1,C$1:C166, 1))),\"\"))","v":""},null,null,{"$f":"IF(E167=\"\",\"\",IF(COUNTIF(E$6:E166,E167)<1,\"初\",IFERROR(VLOOKUP(INDEX(F$1:F166,_xlfn.AGGREGATE(14,6,ROW(E$6:E166)/(E$6:E166=E167),1)),{\"申\",\"　\";\"　\",\"申\"},2,0),\"\")))","v":""},null,null,null,null,null,null,null,null," "]
[null,{"$f":"IF(C168<>1,\"\",1+INDEX(B:B,MATCH(MAX(B$1:B167)+1,B$1:B167, 1)))","v":""},{"$f":"IF(D168=\"\",\"\",IF(D168<D167,IF(1+INDEX(C:C,MATCH(MAX(C$1:C167)+1,C$1:C167, 1))>12,1,1+INDEX(C:C,MATCH(MAX(C$1:C167)+1,C$1:C167, 1))),\"\"))","v":""},null,null,{"$f":"IF(E168=\"\",\"\",IF(COUNTIF(E$6:E167,E168)<1,\"初\",IFERROR(VLOOKUP(INDEX(F$1:F167,_xlfn.AGGREGATE(14,6,ROW(E$6:E167)/(E$6:E167=E168),1)),{\"申\",\"　\";\"　\",\"申\"},2,0),\"\")))","v":""},null,null,null,null,null,null,null,null," "]
[null,{"$f":"IF(C169<>1,\"\",1+INDEX(B:B,MATCH(MAX(B$1:B168)+1,B$1:B168, 1)))","v":""},{"$f":"IF(D169=\"\",\"\",IF(D169<D168,IF(1+INDEX(C:C,MATCH(MAX(C$1:C168)+1,C$1:C168, 1))>12,1,1+INDEX(C:C,MATCH(MAX(C$1:C168)+1,C$1:C168, 1))),\"\"))","v":""},null,null,{"$f":"IF(E169=\"\",\"\",IF(COUNTIF(E$6:E168,E169)<1,\"初\",IFERROR(VLOOKUP(INDEX(F$1:F168,_xlfn.AGGREGATE(14,6,ROW(E$6:E168)/(E$6:E168=E169),1)),{\"申\",\"　\";\"　\",\"申\"},2,0),\"\")))","v":""},null,null,null,null,null,null,null,null," "]
[null,{"$f":"IF(C170<>1,\"\",1+INDEX(B:B,MATCH(MAX(B$1:B169)+1,B$1:B169, 1)))","v":""},{"$f":"IF(D170=\"\",\"\",IF(D170<D169,IF(1+INDEX(C:C,MATCH(MAX(C$1:C169)+1,C$1:C169, 1))>12,1,1+INDEX(C:C,MATCH(MAX(C$1:C169)+1,C$1:C169, 1))),\"\"))","v":""},null,null,{"$f":"IF(E170=\"\",\"\",IF(COUNTIF(E$6:E169,E170)<1,\"初\",IFERROR(VLOOKUP(INDEX(F$1:F169,_xlfn.AGGREGATE(14,6,ROW(E$6:E169)/(E$6:E169=E170),1)),{\"申\",\"　\";\"　\",\"申\"},2,0),\"\")))","v":""},null,null,null,null,null,null,null,null," "]
[null,{"$f":"IF(C171<>1,\"\",1+INDEX(B:B,MATCH(MAX(B$1:B170)+1,B$1:B170, 1)))","v":""},{"$f":"IF(D171=\"\",\"\",IF(D171<D170,IF(1+INDEX(C:C,MATCH(MAX(C$1:C170)+1,C$1:C170, 1))>12,1,1+INDEX(C:C,MATCH(MAX(C$1:C170)+1,C$1:C170, 1))),\"\"))","v":""},null,null,{"$f":"IF(E171=\"\",\"\",IF(COUNTIF(E$6:E170,E171)<1,\"初\",IFERROR(VLOOKUP(INDEX(F$1:F170,_xlfn.AGGREGATE(14,6,ROW(E$6:E170)/(E$6:E170=E171),1)),{\"申\",\"　\";\"　\",\"申\"},2,0),\"\")))","v":""},null,null,null,null,null,null,null,null," "]
[null,{"$f":"IF(C172<>1,\"\",1+INDEX(B:B,MATCH(MAX(B$1:B171)+1,B$1:B171, 1)))","v":""},{"$f":"IF(D172=\"\",\"\",IF(D172<D171,IF(1+INDEX(C:C,MATCH(MAX(C$1:C171)+1,C$1:C171, 1))>12,1,1+INDEX(C:C,MATCH(MAX(C$1:C171)+1,C$1:C171, 1))),\"\"))","v":""},null,null,{"$f":"IF(E172=\"\",\"\",IF(COUNTIF(E$6:E171,E172)<1,\"初\",IFERROR(VLOOKUP(INDEX(F$1:F171,_xlfn.AGGREGATE(14,6,ROW(E$6:E171)/(E$6:E171=E172),1)),{\"申\",\"　\";\"　\",\"申\"},2,0),\"\")))","v":""},null,null,null,null,null,null,null,null," "]
[null,{"$f":"IF(C173<>1,\"\",1+INDEX(B:B,MATCH(MAX(B$1:B172)+1,B$1:B172, 1)))","v":""},{"$f":"IF(D173=\"\",\"\",IF(D173<D172,IF(1+INDEX(C:C,MATCH(MAX(C$1:C172)+1,C$1:C172, 1))>12,1,1+INDEX(C:C,MATCH(MAX(C$1:C172)+1,C$1:C172, 1))),\"\"))","v":""},null,null,{"$f":"IF(E173=\"\",\"\",IF(COUNTIF(E$6:E172,E173)<1,\"初\",IFERROR(VLOOKUP(INDEX(F$1:F172,_xlfn.AGGREGATE(14,6,ROW(E$6:E172)/(E$6:E172=E173),1)),{\"申\",\"　\";\"　\",\"申\"},2,0),\"\")))","v":""},null,null,null,null,null,null,null,null," "]
[null,{"$f":"IF(C174<>1,\"\",1+INDEX(B:B,MATCH(MAX(B$1:B173)+1,B$1:B173, 1)))","v":""},{"$f":"IF(D174=\"\",\"\",IF(D174<D173,IF(1+INDEX(C:C,MATCH(MAX(C$1:C173)+1,C$1:C173, 1))>12,1,1+INDEX(C:C,MATCH(MAX(C$1:C173)+1,C$1:C173, 1))),\"\"))","v":""},null,null,{"$f":"IF(E174=\"\",\"\",IF(COUNTIF(E$6:E173,E174)<1,\"初\",IFERROR(VLOOKUP(INDEX(F$1:F173,_xlfn.AGGREGATE(14,6,ROW(E$6:E173)/(E$6:E173=E174),1)),{\"申\",\"　\";\"　\",\"申\"},2,0),\"\")))","v":""},null,null,null,null,null,null,null,null," "]
[null,{"$f":"IF(C175<>1,\"\",1+INDEX(B:B,MATCH(MAX(B$1:B174)+1,B$1:B174, 1)))","v":""},{"$f":"IF(D175=\"\",\"\",IF(D175<D174,IF(1+INDEX(C:C,MATCH(MAX(C$1:C174)+1,C$1:C174, 1))>12,1,1+INDEX(C:C,MATCH(MAX(C$1:C174)+1,C$1:C174, 1))),\"\"))","v":""},null,null,{"$f":"IF(E175=\"\",\"\",IF(COUNTIF(E$6:E174,E175)<1,\"初\",IFERROR(VLOOKUP(INDEX(F$1:F174,_xlfn.AGGREGATE(14,6,ROW(E$6:E174)/(E$6:E174=E175),1)),{\"申\",\"　\";\"　\",\"申\"},2,0),\"\")))","v":""},null,null,null,null,null,null,null,null," "]
[null,{"$f":"IF(C176<>1,\"\",1+INDEX(B:B,MATCH(MAX(B$1:B175)+1,B$1:B175, 1)))","v":""},{"$f":"IF(D176=\"\",\"\",IF(D176<D175,IF(1+INDEX(C:C,MATCH(MAX(C$1:C175)+1,C$1:C175, 1))>12,1,1+INDEX(C:C,MATCH(MAX(C$1:C175)+1,C$1:C175, 1))),\"\"))","v":""},null,null,{"$f":"IF(E176=\"\",\"\",IF(COUNTIF(E$6:E175,E176)<1,\"初\",IFERROR(VLOOKUP(INDEX(F$1:F175,_xlfn.AGGREGATE(14,6,ROW(E$6:E175)/(E$6:E175=E176),1)),{\"申\",\"　\";\"　\",\"申\"},2,0),\"\")))","v":""},null,null,null,null,null,null,null,null," "]
[null,{"$f":"IF(C177<>1,\"\",1+INDEX(B:B,MATCH(MAX(B$1:B176)+1,B$1:B176, 1)))","v":""},{"$f":"IF(D177=\"\",\"\",IF(D177<D176,IF(1+INDEX(C:C,MATCH(MAX(C$1:C176)+1,C$1:C176, 1))>12,1,1+INDEX(C:C,MATCH(MAX(C$1:C176)+1,C$1:C176, 1))),\"\"))","v":""},null,null,{"$f":"IF(E177=\"\",\"\",IF(COUNTIF(E$6:E176,E177)<1,\"初\",IFERROR(VLOOKUP(INDEX(F$1:F176,_xlfn.AGGREGATE(14,6,ROW(E$6:E176)/(E$6:E176=E177),1)),{\"申\",\"　\";\"　\",\"申\"},2,0),\"\")))","v":""},null,null,null,null,null,null,null,null," "]
[null,{"$f":"IF(C178<>1,\"\",1+INDEX(B:B,MATCH(MAX(B$1:B177)+1,B$1:B177, 1)))","v":""},{"$f":"IF(D178=\"\",\"\",IF(D178<D177,IF(1+INDEX(C:C,MATCH(MAX(C$1:C177)+1,C$1:C177, 1))>12,1,1+INDEX(C:C,MATCH(MAX(C$1:C177)+1,C$1:C177, 1))),\"\"))","v":""},null,null,{"$f":"IF(E178=\"\",\"\",IF(COUNTIF(E$6:E177,E178)<1,\"初\",IFERROR(VLOOKUP(INDEX(F$1:F177,_xlfn.AGGREGATE(14,6,ROW(E$6:E177)/(E$6:E177=E178),1)),{\"申\",\"　\";\"　\",\"申\"},2,0),\"\")))","v":""},null,null,null,null,null,null,null,null," "]
[null,{"$f":"IF(C179<>1,\"\",1+INDEX(B:B,MATCH(MAX(B$1:B178)+1,B$1:B178, 1)))","v":""},{"$f":"IF(D179=\"\",\"\",IF(D179<D178,IF(1+INDEX(C:C,MATCH(MAX(C$1:C178)+1,C$1:C178, 1))>12,1,1+INDEX(C:C,MATCH(MAX(C$1:C178)+1,C$1:C178, 1))),\"\"))","v":""},null,null,{"$f":"IF(E179=\"\",\"\",IF(COUNTIF(E$6:E178,E179)<1,\"初\",IFERROR(VLOOKUP(INDEX(F$1:F178,_xlfn.AGGREGATE(14,6,ROW(E$6:E178)/(E$6:E178=E179),1)),{\"申\",\"　\";\"　\",\"申\"},2,0),\"\")))","v":""},null,null,null,null,null,null,null,null," "]
[null,{"$f":"IF(C180<>1,\"\",1+INDEX(B:B,MATCH(MAX(B$1:B179)+1,B$1:B179, 1)))","v":""},{"$f":"IF(D180=\"\",\"\",IF(D180<D179,IF(1+INDEX(C:C,MATCH(MAX(C$1:C179)+1,C$1:C179, 1))>12,1,1+INDEX(C:C,MATCH(MAX(C$1:C179)+1,C$1:C179, 1))),\"\"))","v":""},null,null,{"$f":"IF(E180=\"\",\"\",IF(COUNTIF(E$6:E179,E180)<1,\"初\",IFERROR(VLOOKUP(INDEX(F$1:F179,_xlfn.AGGREGATE(14,6,ROW(E$6:E179)/(E$6:E179=E180),1)),{\"申\",\"　\";\"　\",\"申\"},2,0),\"\")))","v":""},null,null,null,null,null,null,null,null," "]
[null,{"$f":"IF(C181<>1,\"\",1+INDEX(B:B,MATCH(MAX(B$1:B180)+1,B$1:B180, 1)))","v":""},{"$f":"IF(D181=\"\",\"\",IF(D181<D180,IF(1+INDEX(C:C,MATCH(MAX(C$1:C180)+1,C$1:C180, 1))>12,1,1+INDEX(C:C,MATCH(MAX(C$1:C180)+1,C$1:C180, 1))),\"\"))","v":""},null,null,{"$f":"IF(E181=\"\",\"\",IF(COUNTIF(E$6:E180,E181)<1,\"初\",IFERROR(VLOOKUP(INDEX(F$1:F180,_xlfn.AGGREGATE(14,6,ROW(E$6:E180)/(E$6:E180=E181),1)),{\"申\",\"　\";\"　\",\"申\"},2,0),\"\")))","v":""},null,null,null,null,null,null,null,null," "]
[null,{"$f":"IF(C182<>1,\"\",1+INDEX(B:B,MATCH(MAX(B$1:B181)+1,B$1:B181, 1)))","v":""},{"$f":"IF(D182=\"\",\"\",IF(D182<D181,IF(1+INDEX(C:C,MATCH(MAX(C$1:C181)+1,C$1:C181, 1))>12,1,1+INDEX(C:C,MATCH(MAX(C$1:C181)+1,C$1:C181, 1))),\"\"))","v":""},null,null,{"$f":"IF(E182=\"\",\"\",IF(COUNTIF(E$6:E181,E182)<1,\"初\",IFERROR(VLOOKUP(INDEX(F$1:F181,_xlfn.AGGREGATE(14,6,ROW(E$6:E181)/(E$6:E181=E182),1)),{\"申\",\"　\";\"　\",\"申\"},2,0),\"\")))","v":""},null,null,null,null,null,null,null,null," "]
[null,{"$f":"IF(C183<>1,\"\",1+INDEX(B:B,MATCH(MAX(B$1:B182)+1,B$1:B182, 1)))","v":""},{"$f":"IF(D183=\"\",\"\",IF(D183<D182,IF(1+INDEX(C:C,MATCH(MAX(C$1:C182)+1,C$1:C182, 1))>12,1,1+INDEX(C:C,MATCH(MAX(C$1:C182)+1,C$1:C182, 1))),\"\"))","v":""},null,null,{"$f":"IF(E183=\"\",\"\",IF(COUNTIF(E$6:E182,E183)<1,\"初\",IFERROR(VLOOKUP(INDEX(F$1:F182,_xlfn.AGGREGATE(14,6,ROW(E$6:E182)/(E$6:E182=E183),1)),{\"申\",\"　\";\"　\",\"申\"},2,0),\"\")))","v":""},null,null,null,null,null,null,null,null," "]
[null,{"$f":"IF(C184<>1,\"\",1+INDEX(B:B,MATCH(MAX(B$1:B183)+1,B$1:B183, 1)))","v":""},{"$f":"IF(D184=\"\",\"\",IF(D184<D183,IF(1+INDEX(C:C,MATCH(MAX(C$1:C183)+1,C$1:C183, 1))>12,1,1+INDEX(C:C,MATCH(MAX(C$1:C183)+1,C$1:C183, 1))),\"\"))","v":""},null,null,{"$f":"IF(E184=\"\",\"\",IF(COUNTIF(E$6:E183,E184)<1,\"初\",IFERROR(VLOOKUP(INDEX(F$1:F183,_xlfn.AGGREGATE(14,6,ROW(E$6:E183)/(E$6:E183=E184),1)),{\"申\",\"　\";\"　\",\"申\"},2,0),\"\")))","v":""},null,null,null,null,null,null,null,null," "]
[null,{"$f":"IF(C185<>1,\"\",1+INDEX(B:B,MATCH(MAX(B$1:B184)+1,B$1:B184, 1)))","v":""},{"$f":"IF(D185=\"\",\"\",IF(D185<D184,IF(1+INDEX(C:C,MATCH(MAX(C$1:C184)+1,C$1:C184, 1))>12,1,1+INDEX(C:C,MATCH(MAX(C$1:C184)+1,C$1:C184, 1))),\"\"))","v":""},null,null,{"$f":"IF(E185=\"\",\"\",IF(COUNTIF(E$6:E184,E185)<1,\"初\",IFERROR(VLOOKUP(INDEX(F$1:F184,_xlfn.AGGREGATE(14,6,ROW(E$6:E184)/(E$6:E184=E185),1)),{\"申\",\"　\";\"　\",\"申\"},2,0),\"\")))","v":""},null,null,null,null,null,null,null,null," "]
[null,{"$f":"IF(C186<>1,\"\",1+INDEX(B:B,MATCH(MAX(B$1:B185)+1,B$1:B185, 1)))","v":""},{"$f":"IF(D186=\"\",\"\",IF(D186<D185,IF(1+INDEX(C:C,MATCH(MAX(C$1:C185)+1,C$1:C185, 1))>12,1,1+INDEX(C:C,MATCH(MAX(C$1:C185)+1,C$1:C185, 1))),\"\"))","v":""},null,null,{"$f":"IF(E186=\"\",\"\",IF(COUNTIF(E$6:E185,E186)<1,\"初\",IFERROR(VLOOKUP(INDEX(F$1:F185,_xlfn.AGGREGATE(14,6,ROW(E$6:E185)/(E$6:E185=E186),1)),{\"申\",\"　\";\"　\",\"申\"},2,0),\"\")))","v":""},null,null,null,null,null,null,null,null," "]
[null,{"$f":"IF(C187<>1,\"\",1+INDEX(B:B,MATCH(MAX(B$1:B186)+1,B$1:B186, 1)))","v":""},{"$f":"IF(D187=\"\",\"\",IF(D187<D186,IF(1+INDEX(C:C,MATCH(MAX(C$1:C186)+1,C$1:C186, 1))>12,1,1+INDEX(C:C,MATCH(MAX(C$1:C186)+1,C$1:C186, 1))),\"\"))","v":""},null,null,{"$f":"IF(E187=\"\",\"\",IF(COUNTIF(E$6:E186,E187)<1,\"初\",IFERROR(VLOOKUP(INDEX(F$1:F186,_xlfn.AGGREGATE(14,6,ROW(E$6:E186)/(E$6:E186=E187),1)),{\"申\",\"　\";\"　\",\"申\"},2,0),\"\")))","v":""},null,null,null,null,null,null,null,null," "]
[null,{"$f":"IF(C188<>1,\"\",1+INDEX(B:B,MATCH(MAX(B$1:B187)+1,B$1:B187, 1)))","v":""},{"$f":"IF(D188=\"\",\"\",IF(D188<D187,IF(1+INDEX(C:C,MATCH(MAX(C$1:C187)+1,C$1:C187, 1))>12,1,1+INDEX(C:C,MATCH(MAX(C$1:C187)+1,C$1:C187, 1))),\"\"))","v":""},null,null,{"$f":"IF(E188=\"\",\"\",IF(COUNTIF(E$6:E187,E188)<1,\"初\",IFERROR(VLOOKUP(INDEX(F$1:F187,_xlfn.AGGREGATE(14,6,ROW(E$6:E187)/(E$6:E187=E188),1)),{\"申\",\"　\";\"　\",\"申\"},2,0),\"\")))","v":""},null,null,null,null,null,null,null,null," "]
[null,{"$f":"IF(C189<>1,\"\",1+INDEX(B:B,MATCH(MAX(B$1:B188)+1,B$1:B188, 1)))","v":""},{"$f":"IF(D189=\"\",\"\",IF(D189<D188,IF(1+INDEX(C:C,MATCH(MAX(C$1:C188)+1,C$1:C188, 1))>12,1,1+INDEX(C:C,MATCH(MAX(C$1:C188)+1,C$1:C188, 1))),\"\"))","v":""},null,null,{"$f":"IF(E189=\"\",\"\",IF(COUNTIF(E$6:E188,E189)<1,\"初\",IFERROR(VLOOKUP(INDEX(F$1:F188,_xlfn.AGGREGATE(14,6,ROW(E$6:E188)/(E$6:E188=E189),1)),{\"申\",\"　\";\"　\",\"申\"},2,0),\"\")))","v":""},null,null,null,null,null,null,null,null," "]
[null,{"$f":"IF(C190<>1,\"\",1+INDEX(B:B,MATCH(MAX(B$1:B189)+1,B$1:B189, 1)))","v":""},{"$f":"IF(D190=\"\",\"\",IF(D190<D189,IF(1+INDEX(C:C,MATCH(MAX(C$1:C189)+1,C$1:C189, 1))>12,1,1+INDEX(C:C,MATCH(MAX(C$1:C189)+1,C$1:C189, 1))),\"\"))","v":""},null,null,{"$f":"IF(E190=\"\",\"\",IF(COUNTIF(E$6:E189,E190)<1,\"初\",IFERROR(VLOOKUP(INDEX(F$1:F189,_xlfn.AGGREGATE(14,6,ROW(E$6:E189)/(E$6:E189=E190),1)),{\"申\",\"　\";\"　\",\"申\"},2,0),\"\")))","v":""},null,null,null,null,null,null,null,null," "]
[null,{"$f":"IF(C191<>1,\"\",1+INDEX(B:B,MATCH(MAX(B$1:B190)+1,B$1:B190, 1)))","v":""},{"$f":"IF(D191=\"\",\"\",IF(D191<D190,IF(1+INDEX(C:C,MATCH(MAX(C$1:C190)+1,C$1:C190, 1))>12,1,1+INDEX(C:C,MATCH(MAX(C$1:C190)+1,C$1:C190, 1))),\"\"))","v":""},null,null,{"$f":"IF(E191=\"\",\"\",IF(COUNTIF(E$6:E190,E191)<1,\"初\",IFERROR(VLOOKUP(INDEX(F$1:F190,_xlfn.AGGREGATE(14,6,ROW(E$6:E190)/(E$6:E190=E191),1)),{\"申\",\"　\";\"　\",\"申\"},2,0),\"\")))","v":""},null,null,null,null,null,null,null,null," "]
[null,{"$f":"IF(C192<>1,\"\",1+INDEX(B:B,MATCH(MAX(B$1:B191)+1,B$1:B191, 1)))","v":""},{"$f":"IF(D192=\"\",\"\",IF(D192<D191,IF(1+INDEX(C:C,MATCH(MAX(C$1:C191)+1,C$1:C191, 1))>12,1,1+INDEX(C:C,MATCH(MAX(C$1:C191)+1,C$1:C191, 1))),\"\"))","v":""},null,null,{"$f":"IF(E192=\"\",\"\",IF(COUNTIF(E$6:E191,E192)<1,\"初\",IFERROR(VLOOKUP(INDEX(F$1:F191,_xlfn.AGGREGATE(14,6,ROW(E$6:E191)/(E$6:E191=E192),1)),{\"申\",\"　\";\"　\",\"申\"},2,0),\"\")))","v":""},null,null,null,null,null,null,null,null," "]
[null,{"$f":"IF(C193<>1,\"\",1+INDEX(B:B,MATCH(MAX(B$1:B192)+1,B$1:B192, 1)))","v":""},{"$f":"IF(D193=\"\",\"\",IF(D193<D192,IF(1+INDEX(C:C,MATCH(MAX(C$1:C192)+1,C$1:C192, 1))>12,1,1+INDEX(C:C,MATCH(MAX(C$1:C192)+1,C$1:C192, 1))),\"\"))","v":""},null,null,{"$f":"IF(E193=\"\",\"\",IF(COUNTIF(E$6:E192,E193)<1,\"初\",IFERROR(VLOOKUP(INDEX(F$1:F192,_xlfn.AGGREGATE(14,6,ROW(E$6:E192)/(E$6:E192=E193),1)),{\"申\",\"　\";\"　\",\"申\"},2,0),\"\")))","v":""},null,null,null,null,null,null,null,null," "]
[null,{"$f":"IF(C194<>1,\"\",1+INDEX(B:B,MATCH(MAX(B$1:B193)+1,B$1:B193, 1)))","v":""},{"$f":"IF(D194=\"\",\"\",IF(D194<D193,IF(1+INDEX(C:C,MATCH(MAX(C$1:C193)+1,C$1:C193, 1))>12,1,1+INDEX(C:C,MATCH(MAX(C$1:C193)+1,C$1:C193, 1))),\"\"))","v":""},null,null,{"$f":"IF(E194=\"\",\"\",IF(COUNTIF(E$6:E193,E194)<1,\"初\",IFERROR(VLOOKUP(INDEX(F$1:F193,_xlfn.AGGREGATE(14,6,ROW(E$6:E193)/(E$6:E193=E194),1)),{\"申\",\"　\";\"　\",\"申\"},2,0),\"\")))","v":""},null,null,null,null,null,null,null,null," "]
[null,{"$f":"IF(C195<>1,\"\",1+INDEX(B:B,MATCH(MAX(B$1:B194)+1,B$1:B194, 1)))","v":""},{"$f":"IF(D195=\"\",\"\",IF(D195<D194,IF(1+INDEX(C:C,MATCH(MAX(C$1:C194)+1,C$1:C194, 1))>12,1,1+INDEX(C:C,MATCH(MAX(C$1:C194)+1,C$1:C194, 1))),\"\"))","v":""},null,null,{"$f":"IF(E195=\"\",\"\",IF(COUNTIF(E$6:E194,E195)<1,\"初\",IFERROR(VLOOKUP(INDEX(F$1:F194,_xlfn.AGGREGATE(14,6,ROW(E$6:E194)/(E$6:E194=E195),1)),{\"申\",\"　\";\"　\",\"申\"},2,0),\"\")))","v":""},null,null,null,null,null,null,null,null," "]
[null,{"$f":"IF(C196<>1,\"\",1+INDEX(B:B,MATCH(MAX(B$1:B195)+1,B$1:B195, 1)))","v":""},{"$f":"IF(D196=\"\",\"\",IF(D196<D195,IF(1+INDEX(C:C,MATCH(MAX(C$1:C195)+1,C$1:C195, 1))>12,1,1+INDEX(C:C,MATCH(MAX(C$1:C195)+1,C$1:C195, 1))),\"\"))","v":""},null,null,{"$f":"IF(E196=\"\",\"\",IF(COUNTIF(E$6:E195,E196)<1,\"初\",IFERROR(VLOOKUP(INDEX(F$1:F195,_xlfn.AGGREGATE(14,6,ROW(E$6:E195)/(E$6:E195=E196),1)),{\"申\",\"　\";\"　\",\"申\"},2,0),\"\")))","v":""},null,null,null,null,null,null,null,null," "]
[null,{"$f":"IF(C197<>1,\"\",1+INDEX(B:B,MATCH(MAX(B$1:B196)+1,B$1:B196, 1)))","v":""},{"$f":"IF(D197=\"\",\"\",IF(D197<D196,IF(1+INDEX(C:C,MATCH(MAX(C$1:C196)+1,C$1:C196, 1))>12,1,1+INDEX(C:C,MATCH(MAX(C$1:C196)+1,C$1:C196, 1))),\"\"))","v":""},null,null,{"$f":"IF(E197=\"\",\"\",IF(COUNTIF(E$6:E196,E197)<1,\"初\",IFERROR(VLOOKUP(INDEX(F$1:F196,_xlfn.AGGREGATE(14,6,ROW(E$6:E196)/(E$6:E196=E197),1)),{\"申\",\"　\";\"　\",\"申\"},2,0),\"\")))","v":""},null,null,null,null,null,null,null,null," "]
[null,{"$f":"IF(C198<>1,\"\",1+INDEX(B:B,MATCH(MAX(B$1:B197)+1,B$1:B197, 1)))","v":""},{"$f":"IF(D198=\"\",\"\",IF(D198<D197,IF(1+INDEX(C:C,MATCH(MAX(C$1:C197)+1,C$1:C197, 1))>12,1,1+INDEX(C:C,MATCH(MAX(C$1:C197)+1,C$1:C197, 1))),\"\"))","v":""},null,null,{"$f":"IF(E198=\"\",\"\",IF(COUNTIF(E$6:E197,E198)<1,\"初\",IFERROR(VLOOKUP(INDEX(F$1:F197,_xlfn.AGGREGATE(14,6,ROW(E$6:E197)/(E$6:E197=E198),1)),{\"申\",\"　\";\"　\",\"申\"},2,0),\"\")))","v":""},null,null,null,null,null,null,null,null," "]
[null,{"$f":"IF(C199<>1,\"\",1+INDEX(B:B,MATCH(MAX(B$1:B198)+1,B$1:B198, 1)))","v":""},{"$f":"IF(D199=\"\",\"\",IF(D199<D198,IF(1+INDEX(C:C,MATCH(MAX(C$1:C198)+1,C$1:C198, 1))>12,1,1+INDEX(C:C,MATCH(MAX(C$1:C198)+1,C$1:C198, 1))),\"\"))","v":""},null,null,{"$f":"IF(E199=\"\",\"\",IF(COUNTIF(E$6:E198,E199)<1,\"初\",IFERROR(VLOOKUP(INDEX(F$1:F198,_xlfn.AGGREGATE(14,6,ROW(E$6:E198)/(E$6:E198=E199),1)),{\"申\",\"　\";\"　\",\"申\"},2,0),\"\")))","v":""},null,null,null,null,null,null,null,null," "]
[null,{"$f":"IF(C200<>1,\"\",1+INDEX(B:B,MATCH(MAX(B$1:B199)+1,B$1:B199, 1)))","v":""},{"$f":"IF(D200=\"\",\"\",IF(D200<D199,IF(1+INDEX(C:C,MATCH(MAX(C$1:C199)+1,C$1:C199, 1))>12,1,1+INDEX(C:C,MATCH(MAX(C$1:C199)+1,C$1:C199, 1))),\"\"))","v":""},null,null,{"$f":"IF(E200=\"\",\"\",IF(COUNTIF(E$6:E199,E200)<1,\"初\",IFERROR(VLOOKUP(INDEX(F$1:F199,_xlfn.AGGREGATE(14,6,ROW(E$6:E199)/(E$6:E199=E200),1)),{\"申\",\"　\";\"　\",\"申\"},2,0),\"\")))","v":""},null,null,null,null,null,null,null,null," "]
[null,{"$f":"IF(C201<>1,\"\",1+INDEX(B:B,MATCH(MAX(B$1:B200)+1,B$1:B200, 1)))","v":""},{"$f":"IF(D201=\"\",\"\",IF(D201<D200,IF(1+INDEX(C:C,MATCH(MAX(C$1:C200)+1,C$1:C200, 1))>12,1,1+INDEX(C:C,MATCH(MAX(C$1:C200)+1,C$1:C200, 1))),\"\"))","v":""},null,null,{"$f":"IF(E201=\"\",\"\",IF(COUNTIF(E$6:E200,E201)<1,\"初\",IFERROR(VLOOKUP(INDEX(F$1:F200,_xlfn.AGGREGATE(14,6,ROW(E$6:E200)/(E$6:E200=E201),1)),{\"申\",\"　\";\"　\",\"申\"},2,0),\"\")))","v":""},null,null,null,null,null,null,null,null," "]
[null,{"$f":"IF(C202<>1,\"\",1+INDEX(B:B,MATCH(MAX(B$1:B201)+1,B$1:B201, 1)))","v":""},{"$f":"IF(D202=\"\",\"\",IF(D202<D201,IF(1+INDEX(C:C,MATCH(MAX(C$1:C201)+1,C$1:C201, 1))>12,1,1+INDEX(C:C,MATCH(MAX(C$1:C201)+1,C$1:C201, 1))),\"\"))","v":""},null,null,{"$f":"IF(E202=\"\",\"\",IF(COUNTIF(E$6:E201,E202)<1,\"初\",IFERROR(VLOOKUP(INDEX(F$1:F201,_xlfn.AGGREGATE(14,6,ROW(E$6:E201)/(E$6:E201=E202),1)),{\"申\",\"　\";\"　\",\"申\"},2,0),\"\")))","v":""},null,null,null,null,null,null,null,null," "]
[null,{"$f":"IF(C203<>1,\"\",1+INDEX(B:B,MATCH(MAX(B$1:B202)+1,B$1:B202, 1)))","v":""},{"$f":"IF(D203=\"\",\"\",IF(D203<D202,IF(1+INDEX(C:C,MATCH(MAX(C$1:C202)+1,C$1:C202, 1))>12,1,1+INDEX(C:C,MATCH(MAX(C$1:C202)+1,C$1:C202, 1))),\"\"))","v":""},null,null,{"$f":"IF(E203=\"\",\"\",IF(COUNTIF(E$6:E202,E203)<1,\"初\",IFERROR(VLOOKUP(INDEX(F$1:F202,_xlfn.AGGREGATE(14,6,ROW(E$6:E202)/(E$6:E202=E203),1)),{\"申\",\"　\";\"　\",\"申\"},2,0),\"\")))","v":""},null,null,null,null,null,null,null,null," "]
[null,{"$f":"IF(C204<>1,\"\",1+INDEX(B:B,MATCH(MAX(B$1:B203)+1,B$1:B203, 1)))","v":""},{"$f":"IF(D204=\"\",\"\",IF(D204<D203,IF(1+INDEX(C:C,MATCH(MAX(C$1:C203)+1,C$1:C203, 1))>12,1,1+INDEX(C:C,MATCH(MAX(C$1:C203)+1,C$1:C203, 1))),\"\"))","v":""},null,null,{"$f":"IF(E204=\"\",\"\",IF(COUNTIF(E$6:E203,E204)<1,\"初\",IFERROR(VLOOKUP(INDEX(F$1:F203,_xlfn.AGGREGATE(14,6,ROW(E$6:E203)/(E$6:E203=E204),1)),{\"申\",\"　\";\"　\",\"申\"},2,0),\"\")))","v":""},null,null,null,null,null,null,null,null," "]
[null,{"$f":"IF(C205<>1,\"\",1+INDEX(B:B,MATCH(MAX(B$1:B204)+1,B$1:B204, 1)))","v":""},{"$f":"IF(D205=\"\",\"\",IF(D205<D204,IF(1+INDEX(C:C,MATCH(MAX(C$1:C204)+1,C$1:C204, 1))>12,1,1+INDEX(C:C,MATCH(MAX(C$1:C204)+1,C$1:C204, 1))),\"\"))","v":""},null,null,{"$f":"IF(E205=\"\",\"\",IF(COUNTIF(E$6:E204,E205)<1,\"初\",IFERROR(VLOOKUP(INDEX(F$1:F204,_xlfn.AGGREGATE(14,6,ROW(E$6:E204)/(E$6:E204=E205),1)),{\"申\",\"　\";\"　\",\"申\"},2,0),\"\")))","v":""},null,null,null,null,null,null,null,null," "]
[null,{"$f":"IF(C206<>1,\"\",1+INDEX(B:B,MATCH(MAX(B$1:B205)+1,B$1:B205, 1)))","v":""},{"$f":"IF(D206=\"\",\"\",IF(D206<D205,IF(1+INDEX(C:C,MATCH(MAX(C$1:C205)+1,C$1:C205, 1))>12,1,1+INDEX(C:C,MATCH(MAX(C$1:C205)+1,C$1:C205, 1))),\"\"))","v":""},null,null,{"$f":"IF(E206=\"\",\"\",IF(COUNTIF(E$6:E205,E206)<1,\"初\",IFERROR(VLOOKUP(INDEX(F$1:F205,_xlfn.AGGREGATE(14,6,ROW(E$6:E205)/(E$6:E205=E206),1)),{\"申\",\"　\";\"　\",\"申\"},2,0),\"\")))","v":""},null,null,null,null,null,null,null,null," "]
[null,{"$f":"IF(C207<>1,\"\",1+INDEX(B:B,MATCH(MAX(B$1:B206)+1,B$1:B206, 1)))","v":""},{"$f":"IF(D207=\"\",\"\",IF(D207<D206,IF(1+INDEX(C:C,MATCH(MAX(C$1:C206)+1,C$1:C206, 1))>12,1,1+INDEX(C:C,MATCH(MAX(C$1:C206)+1,C$1:C206, 1))),\"\"))","v":""},null,null,{"$f":"IF(E207=\"\",\"\",IF(COUNTIF(E$6:E206,E207)<1,\"初\",IFERROR(VLOOKUP(INDEX(F$1:F206,_xlfn.AGGREGATE(14,6,ROW(E$6:E206)/(E$6:E206=E207),1)),{\"申\",\"　\";\"　\",\"申\"},2,0),\"\")))","v":""},null,null,null,null,null,null,null,null," "]
[null,{"$f":"IF(C208<>1,\"\",1+INDEX(B:B,MATCH(MAX(B$1:B207)+1,B$1:B207, 1)))","v":""},{"$f":"IF(D208=\"\",\"\",IF(D208<D207,IF(1+INDEX(C:C,MATCH(MAX(C$1:C207)+1,C$1:C207, 1))>12,1,1+INDEX(C:C,MATCH(MAX(C$1:C207)+1,C$1:C207, 1))),\"\"))","v":""},null,null,{"$f":"IF(E208=\"\",\"\",IF(COUNTIF(E$6:E207,E208)<1,\"初\",IFERROR(VLOOKUP(INDEX(F$1:F207,_xlfn.AGGREGATE(14,6,ROW(E$6:E207)/(E$6:E207=E208),1)),{\"申\",\"　\";\"　\",\"申\"},2,0),\"\")))","v":""},null,null,null,null,null,null,null,null," "]
[null,{"$f":"IF(C209<>1,\"\",1+INDEX(B:B,MATCH(MAX(B$1:B208)+1,B$1:B208, 1)))","v":""},{"$f":"IF(D209=\"\",\"\",IF(D209<D208,IF(1+INDEX(C:C,MATCH(MAX(C$1:C208)+1,C$1:C208, 1))>12,1,1+INDEX(C:C,MATCH(MAX(C$1:C208)+1,C$1:C208, 1))),\"\"))","v":""},null,null,{"$f":"IF(E209=\"\",\"\",IF(COUNTIF(E$6:E208,E209)<1,\"初\",IFERROR(VLOOKUP(INDEX(F$1:F208,_xlfn.AGGREGATE(14,6,ROW(E$6:E208)/(E$6:E208=E209),1)),{\"申\",\"　\";\"　\",\"申\"},2,0),\"\")))","v":""},null,null,null,null,null,null,null,null," "]
[null,{"$f":"IF(C210<>1,\"\",1+INDEX(B:B,MATCH(MAX(B$1:B209)+1,B$1:B209, 1)))","v":""},{"$f":"IF(D210=\"\",\"\",IF(D210<D209,IF(1+INDEX(C:C,MATCH(MAX(C$1:C209)+1,C$1:C209, 1))>12,1,1+INDEX(C:C,MATCH(MAX(C$1:C209)+1,C$1:C209, 1))),\"\"))","v":""},null,null,{"$f":"IF(E210=\"\",\"\",IF(COUNTIF(E$6:E209,E210)<1,\"初\",IFERROR(VLOOKUP(INDEX(F$1:F209,_xlfn.AGGREGATE(14,6,ROW(E$6:E209)/(E$6:E209=E210),1)),{\"申\",\"　\";\"　\",\"申\"},2,0),\"\")))","v":""},null,null,null,null,null,null,null,null," "]
[null,{"$f":"IF(C211<>1,\"\",1+INDEX(B:B,MATCH(MAX(B$1:B210)+1,B$1:B210, 1)))","v":""},{"$f":"IF(D211=\"\",\"\",IF(D211<D210,IF(1+INDEX(C:C,MATCH(MAX(C$1:C210)+1,C$1:C210, 1))>12,1,1+INDEX(C:C,MATCH(MAX(C$1:C210)+1,C$1:C210, 1))),\"\"))","v":""},null,null,{"$f":"IF(E211=\"\",\"\",IF(COUNTIF(E$6:E210,E211)<1,\"初\",IFERROR(VLOOKUP(INDEX(F$1:F210,_xlfn.AGGREGATE(14,6,ROW(E$6:E210)/(E$6:E210=E211),1)),{\"申\",\"　\";\"　\",\"申\"},2,0),\"\")))","v":""},null,null,null,null,null,null,null,null," "]
[null,{"$f":"IF(C212<>1,\"\",1+INDEX(B:B,MATCH(MAX(B$1:B211)+1,B$1:B211, 1)))","v":""},{"$f":"IF(D212=\"\",\"\",IF(D212<D211,IF(1+INDEX(C:C,MATCH(MAX(C$1:C211)+1,C$1:C211, 1))>12,1,1+INDEX(C:C,MATCH(MAX(C$1:C211)+1,C$1:C211, 1))),\"\"))","v":""},null,null,{"$f":"IF(E212=\"\",\"\",IF(COUNTIF(E$6:E211,E212)<1,\"初\",IFERROR(VLOOKUP(INDEX(F$1:F211,_xlfn.AGGREGATE(14,6,ROW(E$6:E211)/(E$6:E211=E212),1)),{\"申\",\"　\";\"　\",\"申\"},2,0),\"\")))","v":""},null,null,null,null,null,null,null,null," "]
[null,{"$f":"IF(C213<>1,\"\",1+INDEX(B:B,MATCH(MAX(B$1:B212)+1,B$1:B212, 1)))","v":""},{"$f":"IF(D213=\"\",\"\",IF(D213<D212,IF(1+INDEX(C:C,MATCH(MAX(C$1:C212)+1,C$1:C212, 1))>12,1,1+INDEX(C:C,MATCH(MAX(C$1:C212)+1,C$1:C212, 1))),\"\"))","v":""},null,null,{"$f":"IF(E213=\"\",\"\",IF(COUNTIF(E$6:E212,E213)<1,\"初\",IFERROR(VLOOKUP(INDEX(F$1:F212,_xlfn.AGGREGATE(14,6,ROW(E$6:E212)/(E$6:E212=E213),1)),{\"申\",\"　\";\"　\",\"申\"},2,0),\"\")))","v":""},null,null,null,null,null,null,null,null," "]
[null,{"$f":"IF(C214<>1,\"\",1+INDEX(B:B,MATCH(MAX(B$1:B213)+1,B$1:B213, 1)))","v":""},{"$f":"IF(D214=\"\",\"\",IF(D214<D213,IF(1+INDEX(C:C,MATCH(MAX(C$1:C213)+1,C$1:C213, 1))>12,1,1+INDEX(C:C,MATCH(MAX(C$1:C213)+1,C$1:C213, 1))),\"\"))","v":""},null,null,{"$f":"IF(E214=\"\",\"\",IF(COUNTIF(E$6:E213,E214)<1,\"初\",IFERROR(VLOOKUP(INDEX(F$1:F213,_xlfn.AGGREGATE(14,6,ROW(E$6:E213)/(E$6:E213=E214),1)),{\"申\",\"　\";\"　\",\"申\"},2,0),\"\")))","v":""},null,null,null,null,null,null,null,null," "]
[null,{"$f":"IF(C215<>1,\"\",1+INDEX(B:B,MATCH(MAX(B$1:B214)+1,B$1:B214, 1)))","v":""},{"$f":"IF(D215=\"\",\"\",IF(D215<D214,IF(1+INDEX(C:C,MATCH(MAX(C$1:C214)+1,C$1:C214, 1))>12,1,1+INDEX(C:C,MATCH(MAX(C$1:C214)+1,C$1:C214, 1))),\"\"))","v":""},null,null,{"$f":"IF(E215=\"\",\"\",IF(COUNTIF(E$6:E214,E215)<1,\"初\",IFERROR(VLOOKUP(INDEX(F$1:F214,_xlfn.AGGREGATE(14,6,ROW(E$6:E214)/(E$6:E214=E215),1)),{\"申\",\"　\";\"　\",\"申\"},2,0),\"\")))","v":""},null,null,null,null,null,null,null,null," "]
[null,{"$f":"IF(C216<>1,\"\",1+INDEX(B:B,MATCH(MAX(B$1:B215)+1,B$1:B215, 1)))","v":""},{"$f":"IF(D216=\"\",\"\",IF(D216<D215,IF(1+INDEX(C:C,MATCH(MAX(C$1:C215)+1,C$1:C215, 1))>12,1,1+INDEX(C:C,MATCH(MAX(C$1:C215)+1,C$1:C215, 1))),\"\"))","v":""},null,null,{"$f":"IF(E216=\"\",\"\",IF(COUNTIF(E$6:E215,E216)<1,\"初\",IFERROR(VLOOKUP(INDEX(F$1:F215,_xlfn.AGGREGATE(14,6,ROW(E$6:E215)/(E$6:E215=E216),1)),{\"申\",\"　\";\"　\",\"申\"},2,0),\"\")))","v":""},null,null,null,null,null,null,null,null," "]
[null,{"$f":"IF(C217<>1,\"\",1+INDEX(B:B,MATCH(MAX(B$1:B216)+1,B$1:B216, 1)))","v":""},{"$f":"IF(D217=\"\",\"\",IF(D217<D216,IF(1+INDEX(C:C,MATCH(MAX(C$1:C216)+1,C$1:C216, 1))>12,1,1+INDEX(C:C,MATCH(MAX(C$1:C216)+1,C$1:C216, 1))),\"\"))","v":""},null,null,{"$f":"IF(E217=\"\",\"\",IF(COUNTIF(E$6:E216,E217)<1,\"初\",IFERROR(VLOOKUP(INDEX(F$1:F216,_xlfn.AGGREGATE(14,6,ROW(E$6:E216)/(E$6:E216=E217),1)),{\"申\",\"　\";\"　\",\"申\"},2,0),\"\")))","v":""},null,null,null,null,null,null,null,null," "]
[null,{"$f":"IF(C218<>1,\"\",1+INDEX(B:B,MATCH(MAX(B$1:B217)+1,B$1:B217, 1)))","v":""},{"$f":"IF(D218=\"\",\"\",IF(D218<D217,IF(1+INDEX(C:C,MATCH(MAX(C$1:C217)+1,C$1:C217, 1))>12,1,1+INDEX(C:C,MATCH(MAX(C$1:C217)+1,C$1:C217, 1))),\"\"))","v":""},null,null,{"$f":"IF(E218=\"\",\"\",IF(COUNTIF(E$6:E217,E218)<1,\"初\",IFERROR(VLOOKUP(INDEX(F$1:F217,_xlfn.AGGREGATE(14,6,ROW(E$6:E217)/(E$6:E217=E218),1)),{\"申\",\"　\";\"　\",\"申\"},2,0),\"\")))","v":""},null,null,null,null,null,null,null,null," "]
[null,{"$f":"IF(C219<>1,\"\",1+INDEX(B:B,MATCH(MAX(B$1:B218)+1,B$1:B218, 1)))","v":""},{"$f":"IF(D219=\"\",\"\",IF(D219<D218,IF(1+INDEX(C:C,MATCH(MAX(C$1:C218)+1,C$1:C218, 1))>12,1,1+INDEX(C:C,MATCH(MAX(C$1:C218)+1,C$1:C218, 1))),\"\"))","v":""},null,null,{"$f":"IF(E219=\"\",\"\",IF(COUNTIF(E$6:E218,E219)<1,\"初\",IFERROR(VLOOKUP(INDEX(F$1:F218,_xlfn.AGGREGATE(14,6,ROW(E$6:E218)/(E$6:E218=E219),1)),{\"申\",\"　\";\"　\",\"申\"},2,0),\"\")))","v":""},null,null,null,null,null,null,null,null," "]
[null,{"$f":"IF(C220<>1,\"\",1+INDEX(B:B,MATCH(MAX(B$1:B219)+1,B$1:B219, 1)))","v":""},{"$f":"IF(D220=\"\",\"\",IF(D220<D219,IF(1+INDEX(C:C,MATCH(MAX(C$1:C219)+1,C$1:C219, 1))>12,1,1+INDEX(C:C,MATCH(MAX(C$1:C219)+1,C$1:C219, 1))),\"\"))","v":""},null,null,{"$f":"IF(E220=\"\",\"\",IF(COUNTIF(E$6:E219,E220)<1,\"初\",IFERROR(VLOOKUP(INDEX(F$1:F219,_xlfn.AGGREGATE(14,6,ROW(E$6:E219)/(E$6:E219=E220),1)),{\"申\",\"　\";\"　\",\"申\"},2,0),\"\")))","v":""},null,null,null,null,null,null,null,null," "]
[null,{"$f":"IF(C221<>1,\"\",1+INDEX(B:B,MATCH(MAX(B$1:B220)+1,B$1:B220, 1)))","v":""},{"$f":"IF(D221=\"\",\"\",IF(D221<D220,IF(1+INDEX(C:C,MATCH(MAX(C$1:C220)+1,C$1:C220, 1))>12,1,1+INDEX(C:C,MATCH(MAX(C$1:C220)+1,C$1:C220, 1))),\"\"))","v":""},null,null,{"$f":"IF(E221=\"\",\"\",IF(COUNTIF(E$6:E220,E221)<1,\"初\",IFERROR(VLOOKUP(INDEX(F$1:F220,_xlfn.AGGREGATE(14,6,ROW(E$6:E220)/(E$6:E220=E221),1)),{\"申\",\"　\";\"　\",\"申\"},2,0),\"\")))","v":""},null,null,null,null,null,null,null,null," "]
[null,{"$f":"IF(C222<>1,\"\",1+INDEX(B:B,MATCH(MAX(B$1:B221)+1,B$1:B221, 1)))","v":""},{"$f":"IF(D222=\"\",\"\",IF(D222<D221,IF(1+INDEX(C:C,MATCH(MAX(C$1:C221)+1,C$1:C221, 1))>12,1,1+INDEX(C:C,MATCH(MAX(C$1:C221)+1,C$1:C221, 1))),\"\"))","v":""},null,null,{"$f":"IF(E222=\"\",\"\",IF(COUNTIF(E$6:E221,E222)<1,\"初\",IFERROR(VLOOKUP(INDEX(F$1:F221,_xlfn.AGGREGATE(14,6,ROW(E$6:E221)/(E$6:E221=E222),1)),{\"申\",\"　\";\"　\",\"申\"},2,0),\"\")))","v":""},null,null,null,null,null,null,null,null," "]
[null,{"$f":"IF(C223<>1,\"\",1+INDEX(B:B,MATCH(MAX(B$1:B222)+1,B$1:B222, 1)))","v":""},{"$f":"IF(D223=\"\",\"\",IF(D223<D222,IF(1+INDEX(C:C,MATCH(MAX(C$1:C222)+1,C$1:C222, 1))>12,1,1+INDEX(C:C,MATCH(MAX(C$1:C222)+1,C$1:C222, 1))),\"\"))","v":""},null,null,{"$f":"IF(E223=\"\",\"\",IF(COUNTIF(E$6:E222,E223)<1,\"初\",IFERROR(VLOOKUP(INDEX(F$1:F222,_xlfn.AGGREGATE(14,6,ROW(E$6:E222)/(E$6:E222=E223),1)),{\"申\",\"　\";\"　\",\"申\"},2,0),\"\")))","v":""},null,null,null,null,null,null,null,null,{"$f":"IF(ISERROR(LEFT(E223,FIND(\"　\",E223,1)-1)&\" \"&LEFT(G223,FIND(\"　\",G223,1)-1)&\" \"&K223&L223&\" \"&H223&IF(I223<>\"\",\"or\"&I223,\"\")&J223&M223&N223), \"\", LEFT(E223,FIND(\"　\",E223,1)-1)&\" \"&LEFT(G223,FIND(\"　\",G223,1)-1)&\" \"&K223&L223&\" \"&H223&IF(I223<>\"\",\"or\"&I223,\"\")&J223&M223&N223)&\" \"&F223","v":" "}]
[null,{"$f":"IF(C224<>1,\"\",1+INDEX(B:B,MATCH(MAX(B$1:B223)+1,B$1:B223, 1)))","v":""},{"$f":"IF(D224=\"\",\"\",IF(D224<D223,IF(1+INDEX(C:C,MATCH(MAX(C$1:C223)+1,C$1:C223, 1))>12,1,1+INDEX(C:C,MATCH(MAX(C$1:C223)+1,C$1:C223, 1))),\"\"))","v":""},null,null,{"$f":"IF(E224=\"\",\"\",IF(COUNTIF(E$6:E223,E224)<1,\"初\",IFERROR(VLOOKUP(INDEX(F$1:F223,_xlfn.AGGREGATE(14,6,ROW(E$6:E223)/(E$6:E223=E224),1)),{\"申\",\"　\";\"　\",\"申\"},2,0),\"\")))","v":""},null,null,null,null,null,null,null,null," "]
[null,{"$f":"IF(C225<>1,\"\",1+INDEX(B:B,MATCH(MAX(B$1:B224)+1,B$1:B224, 1)))","v":""},{"$f":"IF(D225=\"\",\"\",IF(D225<D224,IF(1+INDEX(C:C,MATCH(MAX(C$1:C224)+1,C$1:C224, 1))>12,1,1+INDEX(C:C,MATCH(MAX(C$1:C224)+1,C$1:C224, 1))),\"\"))","v":""},null,null,{"$f":"IF(E225=\"\",\"\",IF(COUNTIF(E$6:E224,E225)<1,\"初\",IFERROR(VLOOKUP(INDEX(F$1:F224,_xlfn.AGGREGATE(14,6,ROW(E$6:E224)/(E$6:E224=E225),1)),{\"申\",\"　\";\"　\",\"申\"},2,0),\"\")))","v":""},null,null,null,null,null,null,null,null," "]
[null,{"$f":"IF(C226<>1,\"\",1+INDEX(B:B,MATCH(MAX(B$1:B225)+1,B$1:B225, 1)))","v":""},{"$f":"IF(D226=\"\",\"\",IF(D226<D225,IF(1+INDEX(C:C,MATCH(MAX(C$1:C225)+1,C$1:C225, 1))>12,1,1+INDEX(C:C,MATCH(MAX(C$1:C225)+1,C$1:C225, 1))),\"\"))","v":""},null,null,{"$f":"IF(E226=\"\",\"\",IF(COUNTIF(E$6:E225,E226)<1,\"初\",IFERROR(VLOOKUP(INDEX(F$1:F225,_xlfn.AGGREGATE(14,6,ROW(E$6:E225)/(E$6:E225=E226),1)),{\"申\",\"　\";\"　\",\"申\"},2,0),\"\")))","v":""},null,null,null,null,null,null,null,null," "]
[null,{"$f":"IF(C227<>1,\"\",1+INDEX(B:B,MATCH(MAX(B$1:B226)+1,B$1:B226, 1)))","v":""},{"$f":"IF(D227=\"\",\"\",IF(D227<D226,IF(1+INDEX(C:C,MATCH(MAX(C$1:C226)+1,C$1:C226, 1))>12,1,1+INDEX(C:C,MATCH(MAX(C$1:C226)+1,C$1:C226, 1))),\"\"))","v":""},null,null,{"$f":"IF(E227=\"\",\"\",IF(COUNTIF(E$6:E226,E227)<1,\"初\",IFERROR(VLOOKUP(INDEX(F$1:F226,_xlfn.AGGREGATE(14,6,ROW(E$6:E226)/(E$6:E226=E227),1)),{\"申\",\"　\";\"　\",\"申\"},2,0),\"\")))","v":""},null,null,null,null,null,null,null,null," "]
[null,{"$f":"IF(C228<>1,\"\",1+INDEX(B:B,MATCH(MAX(B$1:B227)+1,B$1:B227, 1)))","v":""},{"$f":"IF(D228=\"\",\"\",IF(D228<D227,IF(1+INDEX(C:C,MATCH(MAX(C$1:C227)+1,C$1:C227, 1))>12,1,1+INDEX(C:C,MATCH(MAX(C$1:C227)+1,C$1:C227, 1))),\"\"))","v":""},null,null,{"$f":"IF(E228=\"\",\"\",IF(COUNTIF(E$6:E227,E228)<1,\"初\",IFERROR(VLOOKUP(INDEX(F$1:F227,_xlfn.AGGREGATE(14,6,ROW(E$6:E227)/(E$6:E227=E228),1)),{\"申\",\"　\";\"　\",\"申\"},2,0),\"\")))","v":""},null,null,null,null,null,null,null,null," "]
[null,{"$f":"IF(C229<>1,\"\",1+INDEX(B:B,MATCH(MAX(B$1:B228)+1,B$1:B228, 1)))","v":""},{"$f":"IF(D229=\"\",\"\",IF(D229<D228,IF(1+INDEX(C:C,MATCH(MAX(C$1:C228)+1,C$1:C228, 1))>12,1,1+INDEX(C:C,MATCH(MAX(C$1:C228)+1,C$1:C228, 1))),\"\"))","v":""},null,null,{"$f":"IF(E229=\"\",\"\",IF(COUNTIF(E$6:E228,E229)<1,\"初\",IFERROR(VLOOKUP(INDEX(F$1:F228,_xlfn.AGGREGATE(14,6,ROW(E$6:E228)/(E$6:E228=E229),1)),{\"申\",\"　\";\"　\",\"申\"},2,0),\"\")))","v":""},null,null,null,null,null,null,null,null," "]
[null,{"$f":"IF(C230<>1,\"\",1+INDEX(B:B,MATCH(MAX(B$1:B229)+1,B$1:B229, 1)))","v":""},{"$f":"IF(D230=\"\",\"\",IF(D230<D229,IF(1+INDEX(C:C,MATCH(MAX(C$1:C229)+1,C$1:C229, 1))>12,1,1+INDEX(C:C,MATCH(MAX(C$1:C229)+1,C$1:C229, 1))),\"\"))","v":""},null,null,{"$f":"IF(E230=\"\",\"\",IF(COUNTIF(E$6:E229,E230)<1,\"初\",IFERROR(VLOOKUP(INDEX(F$1:F229,_xlfn.AGGREGATE(14,6,ROW(E$6:E229)/(E$6:E229=E230),1)),{\"申\",\"　\";\"　\",\"申\"},2,0),\"\")))","v":""},null,null,null,null,null,null,null,null," "]
[null,{"$f":"IF(C231<>1,\"\",1+INDEX(B:B,MATCH(MAX(B$1:B230)+1,B$1:B230, 1)))","v":""},{"$f":"IF(D231=\"\",\"\",IF(D231<D230,IF(1+INDEX(C:C,MATCH(MAX(C$1:C230)+1,C$1:C230, 1))>12,1,1+INDEX(C:C,MATCH(MAX(C$1:C230)+1,C$1:C230, 1))),\"\"))","v":""},null,null,{"$f":"IF(E231=\"\",\"\",IF(COUNTIF(E$6:E230,E231)<1,\"初\",IFERROR(VLOOKUP(INDEX(F$1:F230,_xlfn.AGGREGATE(14,6,ROW(E$6:E230)/(E$6:E230=E231),1)),{\"申\",\"　\";\"　\",\"申\"},2,0),\"\")))","v":""},null,null,null,null,null,null,null,null," "]
[null,{"$f":"IF(C232<>1,\"\",1+INDEX(B:B,MATCH(MAX(B$1:B231)+1,B$1:B231, 1)))","v":""},{"$f":"IF(D232=\"\",\"\",IF(D232<D231,IF(1+INDEX(C:C,MATCH(MAX(C$1:C231)+1,C$1:C231, 1))>12,1,1+INDEX(C:C,MATCH(MAX(C$1:C231)+1,C$1:C231, 1))),\"\"))","v":""},null,null,{"$f":"IF(E232=\"\",\"\",IF(COUNTIF(E$6:E231,E232)<1,\"初\",IFERROR(VLOOKUP(INDEX(F$1:F231,_xlfn.AGGREGATE(14,6,ROW(E$6:E231)/(E$6:E231=E232),1)),{\"申\",\"　\";\"　\",\"申\"},2,0),\"\")))","v":""},null,null,null,null,null,null,null,null," "]
[null,{"$f":"IF(C233<>1,\"\",1+INDEX(B:B,MATCH(MAX(B$1:B232)+1,B$1:B232, 1)))","v":""},{"$f":"IF(D233=\"\",\"\",IF(D233<D232,IF(1+INDEX(C:C,MATCH(MAX(C$1:C232)+1,C$1:C232, 1))>12,1,1+INDEX(C:C,MATCH(MAX(C$1:C232)+1,C$1:C232, 1))),\"\"))","v":""},null,null,{"$f":"IF(E233=\"\",\"\",IF(COUNTIF(E$6:E232,E233)<1,\"初\",IFERROR(VLOOKUP(INDEX(F$1:F232,_xlfn.AGGREGATE(14,6,ROW(E$6:E232)/(E$6:E232=E233),1)),{\"申\",\"　\";\"　\",\"申\"},2,0),\"\")))","v":""},null,null,null,null,null,null,null,null," "]
[null,{"$f":"IF(C234<>1,\"\",1+INDEX(B:B,MATCH(MAX(B$1:B233)+1,B$1:B233, 1)))","v":""},{"$f":"IF(D234=\"\",\"\",IF(D234<D233,IF(1+INDEX(C:C,MATCH(MAX(C$1:C233)+1,C$1:C233, 1))>12,1,1+INDEX(C:C,MATCH(MAX(C$1:C233)+1,C$1:C233, 1))),\"\"))","v":""},null,null,{"$f":"IF(E234=\"\",\"\",IF(COUNTIF(E$6:E233,E234)<1,\"初\",IFERROR(VLOOKUP(INDEX(F$1:F233,_xlfn.AGGREGATE(14,6,ROW(E$6:E233)/(E$6:E233=E234),1)),{\"申\",\"　\";\"　\",\"申\"},2,0),\"\")))","v":""},null,null,null,null,null,null,null,null," "]
[null,{"$f":"IF(C235<>1,\"\",1+INDEX(B:B,MATCH(MAX(B$1:B234)+1,B$1:B234, 1)))","v":""},{"$f":"IF(D235=\"\",\"\",IF(D235<D234,IF(1+INDEX(C:C,MATCH(MAX(C$1:C234)+1,C$1:C234, 1))>12,1,1+INDEX(C:C,MATCH(MAX(C$1:C234)+1,C$1:C234, 1))),\"\"))","v":""},null,null,{"$f":"IF(E235=\"\",\"\",IF(COUNTIF(E$6:E234,E235)<1,\"初\",IFERROR(VLOOKUP(INDEX(F$1:F234,_xlfn.AGGREGATE(14,6,ROW(E$6:E234)/(E$6:E234=E235),1)),{\"申\",\"　\";\"　\",\"申\"},2,0),\"\")))","v":""},null,null,null,null,null,null,null,null," "]
[null,{"$f":"IF(C236<>1,\"\",1+INDEX(B:B,MATCH(MAX(B$1:B235)+1,B$1:B235, 1)))","v":""},{"$f":"IF(D236=\"\",\"\",IF(D236<D235,IF(1+INDEX(C:C,MATCH(MAX(C$1:C235)+1,C$1:C235, 1))>12,1,1+INDEX(C:C,MATCH(MAX(C$1:C235)+1,C$1:C235, 1))),\"\"))","v":""},null,null,{"$f":"IF(E236=\"\",\"\",IF(COUNTIF(E$6:E235,E236)<1,\"初\",IFERROR(VLOOKUP(INDEX(F$1:F235,_xlfn.AGGREGATE(14,6,ROW(E$6:E235)/(E$6:E235=E236),1)),{\"申\",\"　\";\"　\",\"申\"},2,0),\"\")))","v":""},null,null,null,null,null,null,null,null," "]
[null,{"$f":"IF(C237<>1,\"\",1+INDEX(B:B,MATCH(MAX(B$1:B236)+1,B$1:B236, 1)))","v":""},{"$f":"IF(D237=\"\",\"\",IF(D237<D236,IF(1+INDEX(C:C,MATCH(MAX(C$1:C236)+1,C$1:C236, 1))>12,1,1+INDEX(C:C,MATCH(MAX(C$1:C236)+1,C$1:C236, 1))),\"\"))","v":""},null,null,{"$f":"IF(E237=\"\",\"\",IF(COUNTIF(E$6:E236,E237)<1,\"初\",IFERROR(VLOOKUP(INDEX(F$1:F236,_xlfn.AGGREGATE(14,6,ROW(E$6:E236)/(E$6:E236=E237),1)),{\"申\",\"　\";\"　\",\"申\"},2,0),\"\")))","v":""},null,null,null,null,null,null,null,null," "]
[null,{"$f":"IF(C238<>1,\"\",1+INDEX(B:B,MATCH(MAX(B$1:B237)+1,B$1:B237, 1)))","v":""},{"$f":"IF(D238=\"\",\"\",IF(D238<D237,IF(1+INDEX(C:C,MATCH(MAX(C$1:C237)+1,C$1:C237, 1))>12,1,1+INDEX(C:C,MATCH(MAX(C$1:C237)+1,C$1:C237, 1))),\"\"))","v":""},null,null,{"$f":"IF(E238=\"\",\"\",IF(COUNTIF(E$6:E237,E238)<1,\"初\",IFERROR(VLOOKUP(INDEX(F$1:F237,_xlfn.AGGREGATE(14,6,ROW(E$6:E237)/(E$6:E237=E238),1)),{\"申\",\"　\";\"　\",\"申\"},2,0),\"\")))","v":""},null,null,null,null,null,null,null,null," "]
[null,{"$f":"IF(C239<>1,\"\",1+INDEX(B:B,MATCH(MAX(B$1:B238)+1,B$1:B238, 1)))","v":""},{"$f":"IF(D239=\"\",\"\",IF(D239<D238,IF(1+INDEX(C:C,MATCH(MAX(C$1:C238)+1,C$1:C238, 1))>12,1,1+INDEX(C:C,MATCH(MAX(C$1:C238)+1,C$1:C238, 1))),\"\"))","v":""},null,null,{"$f":"IF(E239=\"\",\"\",IF(COUNTIF(E$6:E238,E239)<1,\"初\",IFERROR(VLOOKUP(INDEX(F$1:F238,_xlfn.AGGREGATE(14,6,ROW(E$6:E238)/(E$6:E238=E239),1)),{\"申\",\"　\";\"　\",\"申\"},2,0),\"\")))","v":""},null,null,null,null,null,null,null,null," "]
[null,{"$f":"IF(C240<>1,\"\",1+INDEX(B:B,MATCH(MAX(B$1:B239)+1,B$1:B239, 1)))","v":""},{"$f":"IF(D240=\"\",\"\",IF(D240<D239,IF(1+INDEX(C:C,MATCH(MAX(C$1:C239)+1,C$1:C239, 1))>12,1,1+INDEX(C:C,MATCH(MAX(C$1:C239)+1,C$1:C239, 1))),\"\"))","v":""},null,null,{"$f":"IF(E240=\"\",\"\",IF(COUNTIF(E$6:E239,E240)<1,\"初\",IFERROR(VLOOKUP(INDEX(F$1:F239,_xlfn.AGGREGATE(14,6,ROW(E$6:E239)/(E$6:E239=E240),1)),{\"申\",\"　\";\"　\",\"申\"},2,0),\"\")))","v":""},null,null,null,null,null,null,null,null," "]
[null,{"$f":"IF(C241<>1,\"\",1+INDEX(B:B,MATCH(MAX(B$1:B240)+1,B$1:B240, 1)))","v":""},{"$f":"IF(D241=\"\",\"\",IF(D241<D240,IF(1+INDEX(C:C,MATCH(MAX(C$1:C240)+1,C$1:C240, 1))>12,1,1+INDEX(C:C,MATCH(MAX(C$1:C240)+1,C$1:C240, 1))),\"\"))","v":""},null,null,{"$f":"IF(E241=\"\",\"\",IF(COUNTIF(E$6:E240,E241)<1,\"初\",IFERROR(VLOOKUP(INDEX(F$1:F240,_xlfn.AGGREGATE(14,6,ROW(E$6:E240)/(E$6:E240=E241),1)),{\"申\",\"　\";\"　\",\"申\"},2,0),\"\")))","v":""},null,null,null,null,null,null,null,null," "]
[null,{"$f":"IF(C242<>1,\"\",1+INDEX(B:B,MATCH(MAX(B$1:B241)+1,B$1:B241, 1)))","v":""},{"$f":"IF(D242=\"\",\"\",IF(D242<D241,IF(1+INDEX(C:C,MATCH(MAX(C$1:C241)+1,C$1:C241, 1))>12,1,1+INDEX(C:C,MATCH(MAX(C$1:C241)+1,C$1:C241, 1))),\"\"))","v":""},null,null,{"$f":"IF(E242=\"\",\"\",IF(COUNTIF(E$6:E241,E242)<1,\"初\",IFERROR(VLOOKUP(INDEX(F$1:F241,_xlfn.AGGREGATE(14,6,ROW(E$6:E241)/(E$6:E241=E242),1)),{\"申\",\"　\";\"　\",\"申\"},2,0),\"\")))","v":""},null,null,null,null,null,null,null,null," "]
[null,{"$f":"IF(C243<>1,\"\",1+INDEX(B:B,MATCH(MAX(B$1:B242)+1,B$1:B242, 1)))","v":""},{"$f":"IF(D243=\"\",\"\",IF(D243<D242,IF(1+INDEX(C:C,MATCH(MAX(C$1:C242)+1,C$1:C242, 1))>12,1,1+INDEX(C:C,MATCH(MAX(C$1:C242)+1,C$1:C242, 1))),\"\"))","v":""},null,null,{"$f":"IF(E243=\"\",\"\",IF(COUNTIF(E$6:E242,E243)<1,\"初\",IFERROR(VLOOKUP(INDEX(F$1:F242,_xlfn.AGGREGATE(14,6,ROW(E$6:E242)/(E$6:E242=E243),1)),{\"申\",\"　\";\"　\",\"申\"},2,0),\"\")))","v":""},null,null,null,null,null,null,null,null," "]
[null,{"$f":"IF(C244<>1,\"\",1+INDEX(B:B,MATCH(MAX(B$1:B243)+1,B$1:B243, 1)))","v":""},{"$f":"IF(D244=\"\",\"\",IF(D244<D243,IF(1+INDEX(C:C,MATCH(MAX(C$1:C243)+1,C$1:C243, 1))>12,1,1+INDEX(C:C,MATCH(MAX(C$1:C243)+1,C$1:C243, 1))),\"\"))","v":""},null,null,{"$f":"IF(E244=\"\",\"\",IF(COUNTIF(E$6:E243,E244)<1,\"初\",IFERROR(VLOOKUP(INDEX(F$1:F243,_xlfn.AGGREGATE(14,6,ROW(E$6:E243)/(E$6:E243=E244),1)),{\"申\",\"　\";\"　\",\"申\"},2,0),\"\")))","v":""},null,null,null,null,null,null,null,null," "]
[null,{"$f":"IF(C245<>1,\"\",1+INDEX(B:B,MATCH(MAX(B$1:B244)+1,B$1:B244, 1)))","v":""},{"$f":"IF(D245=\"\",\"\",IF(D245<D244,IF(1+INDEX(C:C,MATCH(MAX(C$1:C244)+1,C$1:C244, 1))>12,1,1+INDEX(C:C,MATCH(MAX(C$1:C244)+1,C$1:C244, 1))),\"\"))","v":""},null,null,{"$f":"IF(E245=\"\",\"\",IF(COUNTIF(E$6:E244,E245)<1,\"初\",IFERROR(VLOOKUP(INDEX(F$1:F244,_xlfn.AGGREGATE(14,6,ROW(E$6:E244)/(E$6:E244=E245),1)),{\"申\",\"　\";\"　\",\"申\"},2,0),\"\")))","v":""},null,null,null,null,null,null,null,null," "]
[null,{"$f":"IF(C246<>1,\"\",1+INDEX(B:B,MATCH(MAX(B$1:B245)+1,B$1:B245, 1)))","v":""},{"$f":"IF(D246=\"\",\"\",IF(D246<D245,IF(1+INDEX(C:C,MATCH(MAX(C$1:C245)+1,C$1:C245, 1))>12,1,1+INDEX(C:C,MATCH(MAX(C$1:C245)+1,C$1:C245, 1))),\"\"))","v":""},null,null,{"$f":"IF(E246=\"\",\"\",IF(COUNTIF(E$6:E245,E246)<1,\"初\",IFERROR(VLOOKUP(INDEX(F$1:F245,_xlfn.AGGREGATE(14,6,ROW(E$6:E245)/(E$6:E245=E246),1)),{\"申\",\"　\";\"　\",\"申\"},2,0),\"\")))","v":""},null,null,null,null,null,null,null,null," "]
[null,{"$f":"IF(C247<>1,\"\",1+INDEX(B:B,MATCH(MAX(B$1:B246)+1,B$1:B246, 1)))","v":""},{"$f":"IF(D247=\"\",\"\",IF(D247<D246,IF(1+INDEX(C:C,MATCH(MAX(C$1:C246)+1,C$1:C246, 1))>12,1,1+INDEX(C:C,MATCH(MAX(C$1:C246)+1,C$1:C246, 1))),\"\"))","v":""},null,null,{"$f":"IF(E247=\"\",\"\",IF(COUNTIF(E$6:E246,E247)<1,\"初\",IFERROR(VLOOKUP(INDEX(F$1:F246,_xlfn.AGGREGATE(14,6,ROW(E$6:E246)/(E$6:E246=E247),1)),{\"申\",\"　\";\"　\",\"申\"},2,0),\"\")))","v":""},null,null,null,null,null,null,null,null," "]
[null,{"$f":"IF(C248<>1,\"\",1+INDEX(B:B,MATCH(MAX(B$1:B247)+1,B$1:B247, 1)))","v":""},{"$f":"IF(D248=\"\",\"\",IF(D248<D247,IF(1+INDEX(C:C,MATCH(MAX(C$1:C247)+1,C$1:C247, 1))>12,1,1+INDEX(C:C,MATCH(MAX(C$1:C247)+1,C$1:C247, 1))),\"\"))","v":""},null,null,{"$f":"IF(E248=\"\",\"\",IF(COUNTIF(E$6:E247,E248)<1,\"初\",IFERROR(VLOOKUP(INDEX(F$1:F247,_xlfn.AGGREGATE(14,6,ROW(E$6:E247)/(E$6:E247=E248),1)),{\"申\",\"　\";\"　\",\"申\"},2,0),\"\")))","v":""},null,null,null,null,null,null,null,null," "]
[null,{"$f":"IF(C249<>1,\"\",1+INDEX(B:B,MATCH(MAX(B$1:B248)+1,B$1:B248, 1)))","v":""},{"$f":"IF(D249=\"\",\"\",IF(D249<D248,IF(1+INDEX(C:C,MATCH(MAX(C$1:C248)+1,C$1:C248, 1))>12,1,1+INDEX(C:C,MATCH(MAX(C$1:C248)+1,C$1:C248, 1))),\"\"))","v":""},null,null,{"$f":"IF(E249=\"\",\"\",IF(COUNTIF(E$6:E248,E249)<1,\"初\",IFERROR(VLOOKUP(INDEX(F$1:F248,_xlfn.AGGREGATE(14,6,ROW(E$6:E248)/(E$6:E248=E249),1)),{\"申\",\"　\";\"　\",\"申\"},2,0),\"\")))","v":""},null,null,null,null,null,null,null,null," "]
[null,{"$f":"IF(C250<>1,\"\",1+INDEX(B:B,MATCH(MAX(B$1:B249)+1,B$1:B249, 1)))","v":""},{"$f":"IF(D250=\"\",\"\",IF(D250<D249,IF(1+INDEX(C:C,MATCH(MAX(C$1:C249)+1,C$1:C249, 1))>12,1,1+INDEX(C:C,MATCH(MAX(C$1:C249)+1,C$1:C249, 1))),\"\"))","v":""},null,null,{"$f":"IF(E250=\"\",\"\",IF(COUNTIF(E$6:E249,E250)<1,\"初\",IFERROR(VLOOKUP(INDEX(F$1:F249,_xlfn.AGGREGATE(14,6,ROW(E$6:E249)/(E$6:E249=E250),1)),{\"申\",\"　\";\"　\",\"申\"},2,0),\"\")))","v":""},null,null,null,null,null,null,null,null," "]
[null,{"$f":"IF(C251<>1,\"\",1+INDEX(B:B,MATCH(MAX(B$1:B250)+1,B$1:B250, 1)))","v":""},{"$f":"IF(D251=\"\",\"\",IF(D251<D250,IF(1+INDEX(C:C,MATCH(MAX(C$1:C250)+1,C$1:C250, 1))>12,1,1+INDEX(C:C,MATCH(MAX(C$1:C250)+1,C$1:C250, 1))),\"\"))","v":""},null,null,{"$f":"IF(E251=\"\",\"\",IF(COUNTIF(E$6:E250,E251)<1,\"初\",IFERROR(VLOOKUP(INDEX(F$1:F250,_xlfn.AGGREGATE(14,6,ROW(E$6:E250)/(E$6:E250=E251),1)),{\"申\",\"　\";\"　\",\"申\"},2,0),\"\")))","v":""},null,null,null,null,null,null,null,null," "]
[null,{"$f":"IF(C252<>1,\"\",1+INDEX(B:B,MATCH(MAX(B$1:B251)+1,B$1:B251, 1)))","v":""},{"$f":"IF(D252=\"\",\"\",IF(D252<D251,IF(1+INDEX(C:C,MATCH(MAX(C$1:C251)+1,C$1:C251, 1))>12,1,1+INDEX(C:C,MATCH(MAX(C$1:C251)+1,C$1:C251, 1))),\"\"))","v":""},null,null,{"$f":"IF(E252=\"\",\"\",IF(COUNTIF(E$6:E251,E252)<1,\"初\",IFERROR(VLOOKUP(INDEX(F$1:F251,_xlfn.AGGREGATE(14,6,ROW(E$6:E251)/(E$6:E251=E252),1)),{\"申\",\"　\";\"　\",\"申\"},2,0),\"\")))","v":""},null,null,null,null,null,null,null,null," "]
[null,{"$f":"IF(C253<>1,\"\",1+INDEX(B:B,MATCH(MAX(B$1:B252)+1,B$1:B252, 1)))","v":""},{"$f":"IF(D253=\"\",\"\",IF(D253<D252,IF(1+INDEX(C:C,MATCH(MAX(C$1:C252)+1,C$1:C252, 1))>12,1,1+INDEX(C:C,MATCH(MAX(C$1:C252)+1,C$1:C252, 1))),\"\"))","v":""},null,null,{"$f":"IF(E253=\"\",\"\",IF(COUNTIF(E$6:E252,E253)<1,\"初\",IFERROR(VLOOKUP(INDEX(F$1:F252,_xlfn.AGGREGATE(14,6,ROW(E$6:E252)/(E$6:E252=E253),1)),{\"申\",\"　\";\"　\",\"申\"},2,0),\"\")))","v":""},null,null,null,null,null,null,null,null," "]
[null,{"$f":"IF(C254<>1,\"\",1+INDEX(B:B,MATCH(MAX(B$1:B253)+1,B$1:B253, 1)))","v":""},{"$f":"IF(D254=\"\",\"\",IF(D254<D253,IF(1+INDEX(C:C,MATCH(MAX(C$1:C253)+1,C$1:C253, 1))>12,1,1+INDEX(C:C,MATCH(MAX(C$1:C253)+1,C$1:C253, 1))),\"\"))","v":""},null,null,{"$f":"IF(E254=\"\",\"\",IF(COUNTIF(E$6:E253,E254)<1,\"初\",IFERROR(VLOOKUP(INDEX(F$1:F253,_xlfn.AGGREGATE(14,6,ROW(E$6:E253)/(E$6:E253=E254),1)),{\"申\",\"　\";\"　\",\"申\"},2,0),\"\")))","v":""},null,null,null,null,null,null,null,null," "]
[null,{"$f":"IF(C255<>1,\"\",1+INDEX(B:B,MATCH(MAX(B$1:B254)+1,B$1:B254, 1)))","v":""},{"$f":"IF(D255=\"\",\"\",IF(D255<D254,IF(1+INDEX(C:C,MATCH(MAX(C$1:C254)+1,C$1:C254, 1))>12,1,1+INDEX(C:C,MATCH(MAX(C$1:C254)+1,C$1:C254, 1))),\"\"))","v":""},null,null,{"$f":"IF(E255=\"\",\"\",IF(COUNTIF(E$6:E254,E255)<1,\"初\",IFERROR(VLOOKUP(INDEX(F$1:F254,_xlfn.AGGREGATE(14,6,ROW(E$6:E254)/(E$6:E254=E255),1)),{\"申\",\"　\";\"　\",\"申\"},2,0),\"\")))","v":""},null,null,null,null,null,null,null,null," "]
[null,{"$f":"IF(C256<>1,\"\",1+INDEX(B:B,MATCH(MAX(B$1:B255)+1,B$1:B255, 1)))","v":""},{"$f":"IF(D256=\"\",\"\",IF(D256<D255,IF(1+INDEX(C:C,MATCH(MAX(C$1:C255)+1,C$1:C255, 1))>12,1,1+INDEX(C:C,MATCH(MAX(C$1:C255)+1,C$1:C255, 1))),\"\"))","v":""},null,null,{"$f":"IF(E256=\"\",\"\",IF(COUNTIF(E$6:E255,E256)<1,\"初\",IFERROR(VLOOKUP(INDEX(F$1:F255,_xlfn.AGGREGATE(14,6,ROW(E$6:E255)/(E$6:E255=E256),1)),{\"申\",\"　\";\"　\",\"申\"},2,0),\"\")))","v":""},null,null,null,null,null,null,null,null," "]
[null,{"$f":"IF(C257<>1,\"\",1+INDEX(B:B,MATCH(MAX(B$1:B256)+1,B$1:B256, 1)))","v":""},{"$f":"IF(D257=\"\",\"\",IF(D257<D256,IF(1+INDEX(C:C,MATCH(MAX(C$1:C256)+1,C$1:C256, 1))>12,1,1+INDEX(C:C,MATCH(MAX(C$1:C256)+1,C$1:C256, 1))),\"\"))","v":""},null,null,{"$f":"IF(E257=\"\",\"\",IF(COUNTIF(E$6:E256,E257)<1,\"初\",IFERROR(VLOOKUP(INDEX(F$1:F256,_xlfn.AGGREGATE(14,6,ROW(E$6:E256)/(E$6:E256=E257),1)),{\"申\",\"　\";\"　\",\"申\"},2,0),\"\")))","v":""},null,null,null,null,null,null,null,null," "]
[null,{"$f":"IF(C258<>1,\"\",1+INDEX(B:B,MATCH(MAX(B$1:B257)+1,B$1:B257, 1)))","v":""},{"$f":"IF(D258=\"\",\"\",IF(D258<D257,IF(1+INDEX(C:C,MATCH(MAX(C$1:C257)+1,C$1:C257, 1))>12,1,1+INDEX(C:C,MATCH(MAX(C$1:C257)+1,C$1:C257, 1))),\"\"))","v":""},null,null,{"$f":"IF(E258=\"\",\"\",IF(COUNTIF(E$6:E257,E258)<1,\"初\",IFERROR(VLOOKUP(INDEX(F$1:F257,_xlfn.AGGREGATE(14,6,ROW(E$6:E257)/(E$6:E257=E258),1)),{\"申\",\"　\";\"　\",\"申\"},2,0),\"\")))","v":""},null,null,null,null,null,null,null,null," "]
[null,{"$f":"IF(C259<>1,\"\",1+INDEX(B:B,MATCH(MAX(B$1:B258)+1,B$1:B258, 1)))","v":""},{"$f":"IF(D259=\"\",\"\",IF(D259<D258,IF(1+INDEX(C:C,MATCH(MAX(C$1:C258)+1,C$1:C258, 1))>12,1,1+INDEX(C:C,MATCH(MAX(C$1:C258)+1,C$1:C258, 1))),\"\"))","v":""},null,null,{"$f":"IF(E259=\"\",\"\",IF(COUNTIF(E$6:E258,E259)<1,\"初\",IFERROR(VLOOKUP(INDEX(F$1:F258,_xlfn.AGGREGATE(14,6,ROW(E$6:E258)/(E$6:E258=E259),1)),{\"申\",\"　\";\"　\",\"申\"},2,0),\"\")))","v":""},null,null,null,null,null,null,null,null," "]
[null,{"$f":"IF(C260<>1,\"\",1+INDEX(B:B,MATCH(MAX(B$1:B259)+1,B$1:B259, 1)))","v":""},{"$f":"IF(D260=\"\",\"\",IF(D260<D259,IF(1+INDEX(C:C,MATCH(MAX(C$1:C259)+1,C$1:C259, 1))>12,1,1+INDEX(C:C,MATCH(MAX(C$1:C259)+1,C$1:C259, 1))),\"\"))","v":""},null,null,{"$f":"IF(E260=\"\",\"\",IF(COUNTIF(E$6:E259,E260)<1,\"初\",IFERROR(VLOOKUP(INDEX(F$1:F259,_xlfn.AGGREGATE(14,6,ROW(E$6:E259)/(E$6:E259=E260),1)),{\"申\",\"　\";\"　\",\"申\"},2,0),\"\")))","v":""},null,null,null,null,null,null,null,null," "]
[null,{"$f":"IF(C261<>1,\"\",1+INDEX(B:B,MATCH(MAX(B$1:B260)+1,B$1:B260, 1)))","v":""},{"$f":"IF(D261=\"\",\"\",IF(D261<D260,IF(1+INDEX(C:C,MATCH(MAX(C$1:C260)+1,C$1:C260, 1))>12,1,1+INDEX(C:C,MATCH(MAX(C$1:C260)+1,C$1:C260, 1))),\"\"))","v":""},null,null,{"$f":"IF(E261=\"\",\"\",IF(COUNTIF(E$6:E260,E261)<1,\"初\",IFERROR(VLOOKUP(INDEX(F$1:F260,_xlfn.AGGREGATE(14,6,ROW(E$6:E260)/(E$6:E260=E261),1)),{\"申\",\"　\";\"　\",\"申\"},2,0),\"\")))","v":""},null,null,null,null,null,null,null,null," "]
[null,{"$f":"IF(C262<>1,\"\",1+INDEX(B:B,MATCH(MAX(B$1:B261)+1,B$1:B261, 1)))","v":""},{"$f":"IF(D262=\"\",\"\",IF(D262<D261,IF(1+INDEX(C:C,MATCH(MAX(C$1:C261)+1,C$1:C261, 1))>12,1,1+INDEX(C:C,MATCH(MAX(C$1:C261)+1,C$1:C261, 1))),\"\"))","v":""},null,null,{"$f":"IF(E262=\"\",\"\",IF(COUNTIF(E$6:E261,E262)<1,\"初\",IFERROR(VLOOKUP(INDEX(F$1:F261,_xlfn.AGGREGATE(14,6,ROW(E$6:E261)/(E$6:E261=E262),1)),{\"申\",\"　\";\"　\",\"申\"},2,0),\"\")))","v":""},null,null,null,null,null,null,null,null," "]
[null,{"$f":"IF(C263<>1,\"\",1+INDEX(B:B,MATCH(MAX(B$1:B262)+1,B$1:B262, 1)))","v":""},{"$f":"IF(D263=\"\",\"\",IF(D263<D262,IF(1+INDEX(C:C,MATCH(MAX(C$1:C262)+1,C$1:C262, 1))>12,1,1+INDEX(C:C,MATCH(MAX(C$1:C262)+1,C$1:C262, 1))),\"\"))","v":""},null,null,{"$f":"IF(E263=\"\",\"\",IF(COUNTIF(E$6:E262,E263)<1,\"初\",IFERROR(VLOOKUP(INDEX(F$1:F262,_xlfn.AGGREGATE(14,6,ROW(E$6:E262)/(E$6:E262=E263),1)),{\"申\",\"　\";\"　\",\"申\"},2,0),\"\")))","v":""},null,null,null,null,null,null,null,null," "]
[null,{"$f":"IF(C264<>1,\"\",1+INDEX(B:B,MATCH(MAX(B$1:B263)+1,B$1:B263, 1)))","v":""},{"$f":"IF(D264=\"\",\"\",IF(D264<D263,IF(1+INDEX(C:C,MATCH(MAX(C$1:C263)+1,C$1:C263, 1))>12,1,1+INDEX(C:C,MATCH(MAX(C$1:C263)+1,C$1:C263, 1))),\"\"))","v":""},null,null,{"$f":"IF(E264=\"\",\"\",IF(COUNTIF(E$6:E263,E264)<1,\"初\",IFERROR(VLOOKUP(INDEX(F$1:F263,_xlfn.AGGREGATE(14,6,ROW(E$6:E263)/(E$6:E263=E264),1)),{\"申\",\"　\";\"　\",\"申\"},2,0),\"\")))","v":""},null,null,null,null,null,null,null,null," "]
[null,{"$f":"IF(C265<>1,\"\",1+INDEX(B:B,MATCH(MAX(B$1:B264)+1,B$1:B264, 1)))","v":""},{"$f":"IF(D265=\"\",\"\",IF(D265<D264,IF(1+INDEX(C:C,MATCH(MAX(C$1:C264)+1,C$1:C264, 1))>12,1,1+INDEX(C:C,MATCH(MAX(C$1:C264)+1,C$1:C264, 1))),\"\"))","v":""},null,null,{"$f":"IF(E265=\"\",\"\",IF(COUNTIF(E$6:E264,E265)<1,\"初\",IFERROR(VLOOKUP(INDEX(F$1:F264,_xlfn.AGGREGATE(14,6,ROW(E$6:E264)/(E$6:E264=E265),1)),{\"申\",\"　\";\"　\",\"申\"},2,0),\"\")))","v":""},null,null,null,null,null,null,null,null," "]
[null,{"$f":"IF(C266<>1,\"\",1+INDEX(B:B,MATCH(MAX(B$1:B265)+1,B$1:B265, 1)))","v":""},{"$f":"IF(D266=\"\",\"\",IF(D266<D265,IF(1+INDEX(C:C,MATCH(MAX(C$1:C265)+1,C$1:C265, 1))>12,1,1+INDEX(C:C,MATCH(MAX(C$1:C265)+1,C$1:C265, 1))),\"\"))","v":""},null,null,{"$f":"IF(E266=\"\",\"\",IF(COUNTIF(E$6:E265,E266)<1,\"初\",IFERROR(VLOOKUP(INDEX(F$1:F265,_xlfn.AGGREGATE(14,6,ROW(E$6:E265)/(E$6:E265=E266),1)),{\"申\",\"　\";\"　\",\"申\"},2,0),\"\")))","v":""},null,null,null,null,null,null,null,null," "]
[null,{"$f":"IF(C267<>1,\"\",1+INDEX(B:B,MATCH(MAX(B$1:B266)+1,B$1:B266, 1)))","v":""},{"$f":"IF(D267=\"\",\"\",IF(D267<D266,IF(1+INDEX(C:C,MATCH(MAX(C$1:C266)+1,C$1:C266, 1))>12,1,1+INDEX(C:C,MATCH(MAX(C$1:C266)+1,C$1:C266, 1))),\"\"))","v":""},null,null,{"$f":"IF(E267=\"\",\"\",IF(COUNTIF(E$6:E266,E267)<1,\"初\",IFERROR(VLOOKUP(INDEX(F$1:F266,_xlfn.AGGREGATE(14,6,ROW(E$6:E266)/(E$6:E266=E267),1)),{\"申\",\"　\";\"　\",\"申\"},2,0),\"\")))","v":""},null,null,null,null,null,null,null,null," "]
[null,{"$f":"IF(C268<>1,\"\",1+INDEX(B:B,MATCH(MAX(B$1:B267)+1,B$1:B267, 1)))","v":""},{"$f":"IF(D268=\"\",\"\",IF(D268<D267,IF(1+INDEX(C:C,MATCH(MAX(C$1:C267)+1,C$1:C267, 1))>12,1,1+INDEX(C:C,MATCH(MAX(C$1:C267)+1,C$1:C267, 1))),\"\"))","v":""},null,null,{"$f":"IF(E268=\"\",\"\",IF(COUNTIF(E$6:E267,E268)<1,\"初\",IFERROR(VLOOKUP(INDEX(F$1:F267,_xlfn.AGGREGATE(14,6,ROW(E$6:E267)/(E$6:E267=E268),1)),{\"申\",\"　\";\"　\",\"申\"},2,0),\"\")))","v":""},null,null,null,null,null,null,null,null," "]
[null,{"$f":"IF(C269<>1,\"\",1+INDEX(B:B,MATCH(MAX(B$1:B268)+1,B$1:B268, 1)))","v":""},{"$f":"IF(D269=\"\",\"\",IF(D269<D268,IF(1+INDEX(C:C,MATCH(MAX(C$1:C268)+1,C$1:C268, 1))>12,1,1+INDEX(C:C,MATCH(MAX(C$1:C268)+1,C$1:C268, 1))),\"\"))","v":""},null,null,{"$f":"IF(E269=\"\",\"\",IF(COUNTIF(E$6:E268,E269)<1,\"初\",IFERROR(VLOOKUP(INDEX(F$1:F268,_xlfn.AGGREGATE(14,6,ROW(E$6:E268)/(E$6:E268=E269),1)),{\"申\",\"　\";\"　\",\"申\"},2,0),\"\")))","v":""},null,null,null,null,null,null,null,null," "]
[null,{"$f":"IF(C270<>1,\"\",1+INDEX(B:B,MATCH(MAX(B$1:B269)+1,B$1:B269, 1)))","v":""},{"$f":"IF(D270=\"\",\"\",IF(D270<D269,IF(1+INDEX(C:C,MATCH(MAX(C$1:C269)+1,C$1:C269, 1))>12,1,1+INDEX(C:C,MATCH(MAX(C$1:C269)+1,C$1:C269, 1))),\"\"))","v":""},null,null,{"$f":"IF(E270=\"\",\"\",IF(COUNTIF(E$6:E269,E270)<1,\"初\",IFERROR(VLOOKUP(INDEX(F$1:F269,_xlfn.AGGREGATE(14,6,ROW(E$6:E269)/(E$6:E269=E270),1)),{\"申\",\"　\";\"　\",\"申\"},2,0),\"\")))","v":""},null,null,null,null,null,null,null,null," "]
[null,{"$f":"IF(C271<>1,\"\",1+INDEX(B:B,MATCH(MAX(B$1:B270)+1,B$1:B270, 1)))","v":""},{"$f":"IF(D271=\"\",\"\",IF(D271<D270,IF(1+INDEX(C:C,MATCH(MAX(C$1:C270)+1,C$1:C270, 1))>12,1,1+INDEX(C:C,MATCH(MAX(C$1:C270)+1,C$1:C270, 1))),\"\"))","v":""},null,null,{"$f":"IF(E271=\"\",\"\",IF(COUNTIF(E$6:E270,E271)<1,\"初\",IFERROR(VLOOKUP(INDEX(F$1:F270,_xlfn.AGGREGATE(14,6,ROW(E$6:E270)/(E$6:E270=E271),1)),{\"申\",\"　\";\"　\",\"申\"},2,0),\"\")))","v":""},null,null,null,null,null,null,null,null," "]
[null,{"$f":"IF(C272<>1,\"\",1+INDEX(B:B,MATCH(MAX(B$1:B271)+1,B$1:B271, 1)))","v":""},{"$f":"IF(D272=\"\",\"\",IF(D272<D271,IF(1+INDEX(C:C,MATCH(MAX(C$1:C271)+1,C$1:C271, 1))>12,1,1+INDEX(C:C,MATCH(MAX(C$1:C271)+1,C$1:C271, 1))),\"\"))","v":""},null,null,{"$f":"IF(E272=\"\",\"\",IF(COUNTIF(E$6:E271,E272)<1,\"初\",IFERROR(VLOOKUP(INDEX(F$1:F271,_xlfn.AGGREGATE(14,6,ROW(E$6:E271)/(E$6:E271=E272),1)),{\"申\",\"　\";\"　\",\"申\"},2,0),\"\")))","v":""},null,null,null,null,null,null,null,null," "]
[null,{"$f":"IF(C273<>1,\"\",1+INDEX(B:B,MATCH(MAX(B$1:B272)+1,B$1:B272, 1)))","v":""},{"$f":"IF(D273=\"\",\"\",IF(D273<D272,IF(1+INDEX(C:C,MATCH(MAX(C$1:C272)+1,C$1:C272, 1))>12,1,1+INDEX(C:C,MATCH(MAX(C$1:C272)+1,C$1:C272, 1))),\"\"))","v":""},null,null,{"$f":"IF(E273=\"\",\"\",IF(COUNTIF(E$6:E272,E273)<1,\"初\",IFERROR(VLOOKUP(INDEX(F$1:F272,_xlfn.AGGREGATE(14,6,ROW(E$6:E272)/(E$6:E272=E273),1)),{\"申\",\"　\";\"　\",\"申\"},2,0),\"\")))","v":""},null,null,null,null,null,null,null,null," "]
[null,{"$f":"IF(C274<>1,\"\",1+INDEX(B:B,MATCH(MAX(B$1:B273)+1,B$1:B273, 1)))","v":""},{"$f":"IF(D274=\"\",\"\",IF(D274<D273,IF(1+INDEX(C:C,MATCH(MAX(C$1:C273)+1,C$1:C273, 1))>12,1,1+INDEX(C:C,MATCH(MAX(C$1:C273)+1,C$1:C273, 1))),\"\"))","v":""},null,null,{"$f":"IF(E274=\"\",\"\",IF(COUNTIF(E$6:E273,E274)<1,\"初\",IFERROR(VLOOKUP(INDEX(F$1:F273,_xlfn.AGGREGATE(14,6,ROW(E$6:E273)/(E$6:E273=E274),1)),{\"申\",\"　\";\"　\",\"申\"},2,0),\"\")))","v":""},null,null,null,null,null,null,null,null," "]
[null,{"$f":"IF(C275<>1,\"\",1+INDEX(B:B,MATCH(MAX(B$1:B274)+1,B$1:B274, 1)))","v":""},{"$f":"IF(D275=\"\",\"\",IF(D275<D274,IF(1+INDEX(C:C,MATCH(MAX(C$1:C274)+1,C$1:C274, 1))>12,1,1+INDEX(C:C,MATCH(MAX(C$1:C274)+1,C$1:C274, 1))),\"\"))","v":""},null,null,{"$f":"IF(E275=\"\",\"\",IF(COUNTIF(E$6:E274,E275)<1,\"初\",IFERROR(VLOOKUP(INDEX(F$1:F274,_xlfn.AGGREGATE(14,6,ROW(E$6:E274)/(E$6:E274=E275),1)),{\"申\",\"　\";\"　\",\"申\"},2,0),\"\")))","v":""},null,null,null,null,null,null,null,null," "]
[null,{"$f":"IF(C276<>1,\"\",1+INDEX(B:B,MATCH(MAX(B$1:B275)+1,B$1:B275, 1)))","v":""},{"$f":"IF(D276=\"\",\"\",IF(D276<D275,IF(1+INDEX(C:C,MATCH(MAX(C$1:C275)+1,C$1:C275, 1))>12,1,1+INDEX(C:C,MATCH(MAX(C$1:C275)+1,C$1:C275, 1))),\"\"))","v":""},null,null,{"$f":"IF(E276=\"\",\"\",IF(COUNTIF(E$6:E275,E276)<1,\"初\",IFERROR(VLOOKUP(INDEX(F$1:F275,_xlfn.AGGREGATE(14,6,ROW(E$6:E275)/(E$6:E275=E276),1)),{\"申\",\"　\";\"　\",\"申\"},2,0),\"\")))","v":""},null,null,null,null,null,null,null,null," "]
[null,{"$f":"IF(C277<>1,\"\",1+INDEX(B:B,MATCH(MAX(B$1:B276)+1,B$1:B276, 1)))","v":""},{"$f":"IF(D277=\"\",\"\",IF(D277<D276,IF(1+INDEX(C:C,MATCH(MAX(C$1:C276)+1,C$1:C276, 1))>12,1,1+INDEX(C:C,MATCH(MAX(C$1:C276)+1,C$1:C276, 1))),\"\"))","v":""},null,null,{"$f":"IF(E277=\"\",\"\",IF(COUNTIF(E$6:E276,E277)<1,\"初\",IFERROR(VLOOKUP(INDEX(F$1:F276,_xlfn.AGGREGATE(14,6,ROW(E$6:E276)/(E$6:E276=E277),1)),{\"申\",\"　\";\"　\",\"申\"},2,0),\"\")))","v":""},null,null,null,null,null,null,null,null," "]
[null,{"$f":"IF(C278<>1,\"\",1+INDEX(B:B,MATCH(MAX(B$1:B277)+1,B$1:B277, 1)))","v":""},{"$f":"IF(D278=\"\",\"\",IF(D278<D277,IF(1+INDEX(C:C,MATCH(MAX(C$1:C277)+1,C$1:C277, 1))>12,1,1+INDEX(C:C,MATCH(MAX(C$1:C277)+1,C$1:C277, 1))),\"\"))","v":""},null,null,{"$f":"IF(E278=\"\",\"\",IF(COUNTIF(E$6:E277,E278)<1,\"初\",IFERROR(VLOOKUP(INDEX(F$1:F277,_xlfn.AGGREGATE(14,6,ROW(E$6:E277)/(E$6:E277=E278),1)),{\"申\",\"　\";\"　\",\"申\"},2,0),\"\")))","v":""},null,null,null,null,null,null,null,null," "]
[null,{"$f":"IF(C279<>1,\"\",1+INDEX(B:B,MATCH(MAX(B$1:B278)+1,B$1:B278, 1)))","v":""},{"$f":"IF(D279=\"\",\"\",IF(D279<D278,IF(1+INDEX(C:C,MATCH(MAX(C$1:C278)+1,C$1:C278, 1))>12,1,1+INDEX(C:C,MATCH(MAX(C$1:C278)+1,C$1:C278, 1))),\"\"))","v":""},null,null,{"$f":"IF(E279=\"\",\"\",IF(COUNTIF(E$6:E278,E279)<1,\"初\",IFERROR(VLOOKUP(INDEX(F$1:F278,_xlfn.AGGREGATE(14,6,ROW(E$6:E278)/(E$6:E278=E279),1)),{\"申\",\"　\";\"　\",\"申\"},2,0),\"\")))","v":""},null,null,null,null,null,null,null,null," "]
[null,{"$f":"IF(C280<>1,\"\",1+INDEX(B:B,MATCH(MAX(B$1:B279)+1,B$1:B279, 1)))","v":""},{"$f":"IF(D280=\"\",\"\",IF(D280<D279,IF(1+INDEX(C:C,MATCH(MAX(C$1:C279)+1,C$1:C279, 1))>12,1,1+INDEX(C:C,MATCH(MAX(C$1:C279)+1,C$1:C279, 1))),\"\"))","v":""},null,null,{"$f":"IF(E280=\"\",\"\",IF(COUNTIF(E$6:E279,E280)<1,\"初\",IFERROR(VLOOKUP(INDEX(F$1:F279,_xlfn.AGGREGATE(14,6,ROW(E$6:E279)/(E$6:E279=E280),1)),{\"申\",\"　\";\"　\",\"申\"},2,0),\"\")))","v":""},null,null,null,null,null,null,null,null," "]
[null,{"$f":"IF(C281<>1,\"\",1+INDEX(B:B,MATCH(MAX(B$1:B280)+1,B$1:B280, 1)))","v":""},{"$f":"IF(D281=\"\",\"\",IF(D281<D280,IF(1+INDEX(C:C,MATCH(MAX(C$1:C280)+1,C$1:C280, 1))>12,1,1+INDEX(C:C,MATCH(MAX(C$1:C280)+1,C$1:C280, 1))),\"\"))","v":""},null,null,{"$f":"IF(E281=\"\",\"\",IF(COUNTIF(E$6:E280,E281)<1,\"初\",IFERROR(VLOOKUP(INDEX(F$1:F280,_xlfn.AGGREGATE(14,6,ROW(E$6:E280)/(E$6:E280=E281),1)),{\"申\",\"　\";\"　\",\"申\"},2,0),\"\")))","v":""},null,null,null,null,null,null,null,null," "]
[null,{"$f":"IF(C282<>1,\"\",1+INDEX(B:B,MATCH(MAX(B$1:B281)+1,B$1:B281, 1)))","v":""},{"$f":"IF(D282=\"\",\"\",IF(D282<D281,IF(1+INDEX(C:C,MATCH(MAX(C$1:C281)+1,C$1:C281, 1))>12,1,1+INDEX(C:C,MATCH(MAX(C$1:C281)+1,C$1:C281, 1))),\"\"))","v":""},null,null,{"$f":"IF(E282=\"\",\"\",IF(COUNTIF(E$6:E281,E282)<1,\"初\",IFERROR(VLOOKUP(INDEX(F$1:F281,_xlfn.AGGREGATE(14,6,ROW(E$6:E281)/(E$6:E281=E282),1)),{\"申\",\"　\";\"　\",\"申\"},2,0),\"\")))","v":""},null,null,null,null,null,null,null,null," "]
[null,{"$f":"IF(C283<>1,\"\",1+INDEX(B:B,MATCH(MAX(B$1:B282)+1,B$1:B282, 1)))","v":""},{"$f":"IF(D283=\"\",\"\",IF(D283<D282,IF(1+INDEX(C:C,MATCH(MAX(C$1:C282)+1,C$1:C282, 1))>12,1,1+INDEX(C:C,MATCH(MAX(C$1:C282)+1,C$1:C282, 1))),\"\"))","v":""},null,null,{"$f":"IF(E283=\"\",\"\",IF(COUNTIF(E$6:E282,E283)<1,\"初\",IFERROR(VLOOKUP(INDEX(F$1:F282,_xlfn.AGGREGATE(14,6,ROW(E$6:E282)/(E$6:E282=E283),1)),{\"申\",\"　\";\"　\",\"申\"},2,0),\"\")))","v":""},null,null,null,null,null,null,null,null," "]
[null,{"$f":"IF(C284<>1,\"\",1+INDEX(B:B,MATCH(MAX(B$1:B283)+1,B$1:B283, 1)))","v":""},{"$f":"IF(D284=\"\",\"\",IF(D284<D283,IF(1+INDEX(C:C,MATCH(MAX(C$1:C283)+1,C$1:C283, 1))>12,1,1+INDEX(C:C,MATCH(MAX(C$1:C283)+1,C$1:C283, 1))),\"\"))","v":""},null,null,{"$f":"IF(E284=\"\",\"\",IF(COUNTIF(E$6:E283,E284)<1,\"初\",IFERROR(VLOOKUP(INDEX(F$1:F283,_xlfn.AGGREGATE(14,6,ROW(E$6:E283)/(E$6:E283=E284),1)),{\"申\",\"　\";\"　\",\"申\"},2,0),\"\")))","v":""},null,null,null,null,null,null,null,null," "]
[null,{"$f":"IF(C285<>1,\"\",1+INDEX(B:B,MATCH(MAX(B$1:B284)+1,B$1:B284, 1)))","v":""},{"$f":"IF(D285=\"\",\"\",IF(D285<D284,IF(1+INDEX(C:C,MATCH(MAX(C$1:C284)+1,C$1:C284, 1))>12,1,1+INDEX(C:C,MATCH(MAX(C$1:C284)+1,C$1:C284, 1))),\"\"))","v":""},null,null,{"$f":"IF(E285=\"\",\"\",IF(COUNTIF(E$6:E284,E285)<1,\"初\",IFERROR(VLOOKUP(INDEX(F$1:F284,_xlfn.AGGREGATE(14,6,ROW(E$6:E284)/(E$6:E284=E285),1)),{\"申\",\"　\";\"　\",\"申\"},2,0),\"\")))","v":""},null,null,null,null,null,null,null,null," "]
[null,{"$f":"IF(C286<>1,\"\",1+INDEX(B:B,MATCH(MAX(B$1:B285)+1,B$1:B285, 1)))","v":""},{"$f":"IF(D286=\"\",\"\",IF(D286<D285,IF(1+INDEX(C:C,MATCH(MAX(C$1:C285)+1,C$1:C285, 1))>12,1,1+INDEX(C:C,MATCH(MAX(C$1:C285)+1,C$1:C285, 1))),\"\"))","v":""},null,null,{"$f":"IF(E286=\"\",\"\",IF(COUNTIF(E$6:E285,E286)<1,\"初\",IFERROR(VLOOKUP(INDEX(F$1:F285,_xlfn.AGGREGATE(14,6,ROW(E$6:E285)/(E$6:E285=E286),1)),{\"申\",\"　\";\"　\",\"申\"},2,0),\"\")))","v":""},null,null,null,null,null,null,null,null," "]
[null,{"$f":"IF(C287<>1,\"\",1+INDEX(B:B,MATCH(MAX(B$1:B286)+1,B$1:B286, 1)))","v":""},{"$f":"IF(D287=\"\",\"\",IF(D287<D286,IF(1+INDEX(C:C,MATCH(MAX(C$1:C286)+1,C$1:C286, 1))>12,1,1+INDEX(C:C,MATCH(MAX(C$1:C286)+1,C$1:C286, 1))),\"\"))","v":""},null,null,{"$f":"IF(E287=\"\",\"\",IF(COUNTIF(E$6:E286,E287)<1,\"初\",IFERROR(VLOOKUP(INDEX(F$1:F286,_xlfn.AGGREGATE(14,6,ROW(E$6:E286)/(E$6:E286=E287),1)),{\"申\",\"　\";\"　\",\"申\"},2,0),\"\")))","v":""},null,null,null,null,null,null,null,null,{"$f":"IF(ISERROR(LEFT(E287,FIND(\"　\",E287,1)-1)&\" \"&LEFT(G287,FIND(\"　\",G287,1)-1)&\" \"&K287&L287&\" \"&H287&IF(I287<>\"\",\"or\"&I287,\"\")&J287&M287&N287), \"\", LEFT(E287,FIND(\"　\",E287,1)-1)&\" \"&LEFT(G287,FIND(\"　\",G287,1)-1)&\" \"&K287&L287&\" \"&H287&IF(I287<>\"\",\"or\"&I287,\"\")&J287&M287&N287)&\" \"&F287","v":" "}]
[null,{"$f":"IF(C288<>1,\"\",1+INDEX(B:B,MATCH(MAX(B$1:B287)+1,B$1:B287, 1)))","v":""},{"$f":"IF(D288=\"\",\"\",IF(D288<D287,IF(1+INDEX(C:C,MATCH(MAX(C$1:C287)+1,C$1:C287, 1))>12,1,1+INDEX(C:C,MATCH(MAX(C$1:C287)+1,C$1:C287, 1))),\"\"))","v":""},null,null,{"$f":"IF(E288=\"\",\"\",IF(COUNTIF(E$6:E287,E288)<1,\"初\",IFERROR(VLOOKUP(INDEX(F$1:F287,_xlfn.AGGREGATE(14,6,ROW(E$6:E287)/(E$6:E287=E288),1)),{\"申\",\"　\";\"　\",\"申\"},2,0),\"\")))","v":""},null,null,null,null,null,null,null,null," "]
[null,{"$f":"IF(C289<>1,\"\",1+INDEX(B:B,MATCH(MAX(B$1:B288)+1,B$1:B288, 1)))","v":""},{"$f":"IF(D289=\"\",\"\",IF(D289<D288,IF(1+INDEX(C:C,MATCH(MAX(C$1:C288)+1,C$1:C288, 1))>12,1,1+INDEX(C:C,MATCH(MAX(C$1:C288)+1,C$1:C288, 1))),\"\"))","v":""},null,null,{"$f":"IF(E289=\"\",\"\",IF(COUNTIF(E$6:E288,E289)<1,\"初\",IFERROR(VLOOKUP(INDEX(F$1:F288,_xlfn.AGGREGATE(14,6,ROW(E$6:E288)/(E$6:E288=E289),1)),{\"申\",\"　\";\"　\",\"申\"},2,0),\"\")))","v":""},null,null,null,null,null,null,null,null," "]
[null,{"$f":"IF(C290<>1,\"\",1+INDEX(B:B,MATCH(MAX(B$1:B289)+1,B$1:B289, 1)))","v":""},{"$f":"IF(D290=\"\",\"\",IF(D290<D289,IF(1+INDEX(C:C,MATCH(MAX(C$1:C289)+1,C$1:C289, 1))>12,1,1+INDEX(C:C,MATCH(MAX(C$1:C289)+1,C$1:C289, 1))),\"\"))","v":""},null,null,{"$f":"IF(E290=\"\",\"\",IF(COUNTIF(E$6:E289,E290)<1,\"初\",IFERROR(VLOOKUP(INDEX(F$1:F289,_xlfn.AGGREGATE(14,6,ROW(E$6:E289)/(E$6:E289=E290),1)),{\"申\",\"　\";\"　\",\"申\"},2,0),\"\")))","v":""},null,null,null,null,null,null,null,null," "]
[null,{"$f":"IF(C291<>1,\"\",1+INDEX(B:B,MATCH(MAX(B$1:B290)+1,B$1:B290, 1)))","v":""},{"$f":"IF(D291=\"\",\"\",IF(D291<D290,IF(1+INDEX(C:C,MATCH(MAX(C$1:C290)+1,C$1:C290, 1))>12,1,1+INDEX(C:C,MATCH(MAX(C$1:C290)+1,C$1:C290, 1))),\"\"))","v":""},null,null,{"$f":"IF(E291=\"\",\"\",IF(COUNTIF(E$6:E290,E291)<1,\"初\",IFERROR(VLOOKUP(INDEX(F$1:F290,_xlfn.AGGREGATE(14,6,ROW(E$6:E290)/(E$6:E290=E291),1)),{\"申\",\"　\";\"　\",\"申\"},2,0),\"\")))","v":""},null,null,null,null,null,null,null,null," "]
[null,{"$f":"IF(C292<>1,\"\",1+INDEX(B:B,MATCH(MAX(B$1:B291)+1,B$1:B291, 1)))","v":""},{"$f":"IF(D292=\"\",\"\",IF(D292<D291,IF(1+INDEX(C:C,MATCH(MAX(C$1:C291)+1,C$1:C291, 1))>12,1,1+INDEX(C:C,MATCH(MAX(C$1:C291)+1,C$1:C291, 1))),\"\"))","v":""},null,null,{"$f":"IF(E292=\"\",\"\",IF(COUNTIF(E$6:E291,E292)<1,\"初\",IFERROR(VLOOKUP(INDEX(F$1:F291,_xlfn.AGGREGATE(14,6,ROW(E$6:E291)/(E$6:E291=E292),1)),{\"申\",\"　\";\"　\",\"申\"},2,0),\"\")))","v":""},null,null,null,null,null,null,null,null," "]
[null,{"$f":"IF(C293<>1,\"\",1+INDEX(B:B,MATCH(MAX(B$1:B292)+1,B$1:B292, 1)))","v":""},{"$f":"IF(D293=\"\",\"\",IF(D293<D292,IF(1+INDEX(C:C,MATCH(MAX(C$1:C292)+1,C$1:C292, 1))>12,1,1+INDEX(C:C,MATCH(MAX(C$1:C292)+1,C$1:C292, 1))),\"\"))","v":""},null,null,{"$f":"IF(E293=\"\",\"\",IF(COUNTIF(E$6:E292,E293)<1,\"初\",IFERROR(VLOOKUP(INDEX(F$1:F292,_xlfn.AGGREGATE(14,6,ROW(E$6:E292)/(E$6:E292=E293),1)),{\"申\",\"　\";\"　\",\"申\"},2,0),\"\")))","v":""},null,null,null,null,null,null,null,null," "]
[null,{"$f":"IF(C294<>1,\"\",1+INDEX(B:B,MATCH(MAX(B$1:B293)+1,B$1:B293, 1)))","v":""},{"$f":"IF(D294=\"\",\"\",IF(D294<D293,IF(1+INDEX(C:C,MATCH(MAX(C$1:C293)+1,C$1:C293, 1))>12,1,1+INDEX(C:C,MATCH(MAX(C$1:C293)+1,C$1:C293, 1))),\"\"))","v":""},null,null,{"$f":"IF(E294=\"\",\"\",IF(COUNTIF(E$6:E293,E294)<1,\"初\",IFERROR(VLOOKUP(INDEX(F$1:F293,_xlfn.AGGREGATE(14,6,ROW(E$6:E293)/(E$6:E293=E294),1)),{\"申\",\"　\";\"　\",\"申\"},2,0),\"\")))","v":""},null,null,null,null,null,null,null,null," "]
[null,{"$f":"IF(C295<>1,\"\",1+INDEX(B:B,MATCH(MAX(B$1:B294)+1,B$1:B294, 1)))","v":""},{"$f":"IF(D295=\"\",\"\",IF(D295<D294,IF(1+INDEX(C:C,MATCH(MAX(C$1:C294)+1,C$1:C294, 1))>12,1,1+INDEX(C:C,MATCH(MAX(C$1:C294)+1,C$1:C294, 1))),\"\"))","v":""},null,null,{"$f":"IF(E295=\"\",\"\",IF(COUNTIF(E$6:E294,E295)<1,\"初\",IFERROR(VLOOKUP(INDEX(F$1:F294,_xlfn.AGGREGATE(14,6,ROW(E$6:E294)/(E$6:E294=E295),1)),{\"申\",\"　\";\"　\",\"申\"},2,0),\"\")))","v":""},null,null,null,null,null,null,null,null," "]
[null,{"$f":"IF(C296<>1,\"\",1+INDEX(B:B,MATCH(MAX(B$1:B295)+1,B$1:B295, 1)))","v":""},{"$f":"IF(D296=\"\",\"\",IF(D296<D295,IF(1+INDEX(C:C,MATCH(MAX(C$1:C295)+1,C$1:C295, 1))>12,1,1+INDEX(C:C,MATCH(MAX(C$1:C295)+1,C$1:C295, 1))),\"\"))","v":""},null,null,{"$f":"IF(E296=\"\",\"\",IF(COUNTIF(E$6:E295,E296)<1,\"初\",IFERROR(VLOOKUP(INDEX(F$1:F295,_xlfn.AGGREGATE(14,6,ROW(E$6:E295)/(E$6:E295=E296),1)),{\"申\",\"　\";\"　\",\"申\"},2,0),\"\")))","v":""},null,null,null,null,null,null,null,null," "]
[null,{"$f":"IF(C297<>1,\"\",1+INDEX(B:B,MATCH(MAX(B$1:B296)+1,B$1:B296, 1)))","v":""},{"$f":"IF(D297=\"\",\"\",IF(D297<D296,IF(1+INDEX(C:C,MATCH(MAX(C$1:C296)+1,C$1:C296, 1))>12,1,1+INDEX(C:C,MATCH(MAX(C$1:C296)+1,C$1:C296, 1))),\"\"))","v":""},null,null,{"$f":"IF(E297=\"\",\"\",IF(COUNTIF(E$6:E296,E297)<1,\"初\",IFERROR(VLOOKUP(INDEX(F$1:F296,_xlfn.AGGREGATE(14,6,ROW(E$6:E296)/(E$6:E296=E297),1)),{\"申\",\"　\";\"　\",\"申\"},2,0),\"\")))","v":""},null,null,null,null,null,null,null,null," "]
[null,{"$f":"IF(C298<>1,\"\",1+INDEX(B:B,MATCH(MAX(B$1:B297)+1,B$1:B297, 1)))","v":""},{"$f":"IF(D298=\"\",\"\",IF(D298<D297,IF(1+INDEX(C:C,MATCH(MAX(C$1:C297)+1,C$1:C297, 1))>12,1,1+INDEX(C:C,MATCH(MAX(C$1:C297)+1,C$1:C297, 1))),\"\"))","v":""},null,null,{"$f":"IF(E298=\"\",\"\",IF(COUNTIF(E$6:E297,E298)<1,\"初\",IFERROR(VLOOKUP(INDEX(F$1:F297,_xlfn.AGGREGATE(14,6,ROW(E$6:E297)/(E$6:E297=E298),1)),{\"申\",\"　\";\"　\",\"申\"},2,0),\"\")))","v":""},null,null,null,null,null,null,null,null," "]
[null,{"$f":"IF(C299<>1,\"\",1+INDEX(B:B,MATCH(MAX(B$1:B298)+1,B$1:B298, 1)))","v":""},{"$f":"IF(D299=\"\",\"\",IF(D299<D298,IF(1+INDEX(C:C,MATCH(MAX(C$1:C298)+1,C$1:C298, 1))>12,1,1+INDEX(C:C,MATCH(MAX(C$1:C298)+1,C$1:C298, 1))),\"\"))","v":""},null,null,{"$f":"IF(E299=\"\",\"\",IF(COUNTIF(E$6:E298,E299)<1,\"初\",IFERROR(VLOOKUP(INDEX(F$1:F298,_xlfn.AGGREGATE(14,6,ROW(E$6:E298)/(E$6:E298=E299),1)),{\"申\",\"　\";\"　\",\"申\"},2,0),\"\")))","v":""},null,null,null,null,null,null,null,null," "]
[null,{"$f":"IF(C300<>1,\"\",1+INDEX(B:B,MATCH(MAX(B$1:B299)+1,B$1:B299, 1)))","v":""},{"$f":"IF(D300=\"\",\"\",IF(D300<D299,IF(1+INDEX(C:C,MATCH(MAX(C$1:C299)+1,C$1:C299, 1))>12,1,1+INDEX(C:C,MATCH(MAX(C$1:C299)+1,C$1:C299, 1))),\"\"))","v":""},null,null,{"$f":"IF(E300=\"\",\"\",IF(COUNTIF(E$6:E299,E300)<1,\"初\",IFERROR(VLOOKUP(INDEX(F$1:F299,_xlfn.AGGREGATE(14,6,ROW(E$6:E299)/(E$6:E299=E300),1)),{\"申\",\"　\";\"　\",\"申\"},2,0),\"\")))","v":""},null,null,null,null,null,null,null,null," "]
[null,{"$f":"IF(C301<>1,\"\",1+INDEX(B:B,MATCH(MAX(B$1:B300)+1,B$1:B300, 1)))","v":""},{"$f":"IF(D301=\"\",\"\",IF(D301<D300,IF(1+INDEX(C:C,MATCH(MAX(C$1:C300)+1,C$1:C300, 1))>12,1,1+INDEX(C:C,MATCH(MAX(C$1:C300)+1,C$1:C300, 1))),\"\"))","v":""},null,null,{"$f":"IF(E301=\"\",\"\",IF(COUNTIF(E$6:E300,E301)<1,\"初\",IFERROR(VLOOKUP(INDEX(F$1:F300,_xlfn.AGGREGATE(14,6,ROW(E$6:E300)/(E$6:E300=E301),1)),{\"申\",\"　\";\"　\",\"申\"},2,0),\"\")))","v":""},null,null,null,null,null,null,null,null," "]
[null,{"$f":"IF(C302<>1,\"\",1+INDEX(B:B,MATCH(MAX(B$1:B301)+1,B$1:B301, 1)))","v":""},{"$f":"IF(D302=\"\",\"\",IF(D302<D301,IF(1+INDEX(C:C,MATCH(MAX(C$1:C301)+1,C$1:C301, 1))>12,1,1+INDEX(C:C,MATCH(MAX(C$1:C301)+1,C$1:C301, 1))),\"\"))","v":""},null,null,{"$f":"IF(E302=\"\",\"\",IF(COUNTIF(E$6:E301,E302)<1,\"初\",IFERROR(VLOOKUP(INDEX(F$1:F301,_xlfn.AGGREGATE(14,6,ROW(E$6:E301)/(E$6:E301=E302),1)),{\"申\",\"　\";\"　\",\"申\"},2,0),\"\")))","v":""},null,null,null,null,null,null,null,null," "]
[null,{"$f":"IF(C303<>1,\"\",1+INDEX(B:B,MATCH(MAX(B$1:B302)+1,B$1:B302, 1)))","v":""},{"$f":"IF(D303=\"\",\"\",IF(D303<D302,IF(1+INDEX(C:C,MATCH(MAX(C$1:C302)+1,C$1:C302, 1))>12,1,1+INDEX(C:C,MATCH(MAX(C$1:C302)+1,C$1:C302, 1))),\"\"))","v":""},null,null,{"$f":"IF(E303=\"\",\"\",IF(COUNTIF(E$6:E302,E303)<1,\"初\",IFERROR(VLOOKUP(INDEX(F$1:F302,_xlfn.AGGREGATE(14,6,ROW(E$6:E302)/(E$6:E302=E303),1)),{\"申\",\"　\";\"　\",\"申\"},2,0),\"\")))","v":""},null,null,null,null,null,null,null,null," "]
[null,{"$f":"IF(C304<>1,\"\",1+INDEX(B:B,MATCH(MAX(B$1:B303)+1,B$1:B303, 1)))","v":""},{"$f":"IF(D304=\"\",\"\",IF(D304<D303,IF(1+INDEX(C:C,MATCH(MAX(C$1:C303)+1,C$1:C303, 1))>12,1,1+INDEX(C:C,MATCH(MAX(C$1:C303)+1,C$1:C303, 1))),\"\"))","v":""},null,null,{"$f":"IF(E304=\"\",\"\",IF(COUNTIF(E$6:E303,E304)<1,\"初\",IFERROR(VLOOKUP(INDEX(F$1:F303,_xlfn.AGGREGATE(14,6,ROW(E$6:E303)/(E$6:E303=E304),1)),{\"申\",\"　\";\"　\",\"申\"},2,0),\"\")))","v":""},null,null,null,null,null,null,null,null," "]
[null,{"$f":"IF(C305<>1,\"\",1+INDEX(B:B,MATCH(MAX(B$1:B304)+1,B$1:B304, 1)))","v":""},{"$f":"IF(D305=\"\",\"\",IF(D305<D304,IF(1+INDEX(C:C,MATCH(MAX(C$1:C304)+1,C$1:C304, 1))>12,1,1+INDEX(C:C,MATCH(MAX(C$1:C304)+1,C$1:C304, 1))),\"\"))","v":""},null,null,{"$f":"IF(E305=\"\",\"\",IF(COUNTIF(E$6:E304,E305)<1,\"初\",IFERROR(VLOOKUP(INDEX(F$1:F304,_xlfn.AGGREGATE(14,6,ROW(E$6:E304)/(E$6:E304=E305),1)),{\"申\",\"　\";\"　\",\"申\"},2,0),\"\")))","v":""},null,null,null,null,null,null,null,null," "]
[null,{"$f":"IF(C306<>1,\"\",1+INDEX(B:B,MATCH(MAX(B$1:B305)+1,B$1:B305, 1)))","v":""},{"$f":"IF(D306=\"\",\"\",IF(D306<D305,IF(1+INDEX(C:C,MATCH(MAX(C$1:C305)+1,C$1:C305, 1))>12,1,1+INDEX(C:C,MATCH(MAX(C$1:C305)+1,C$1:C305, 1))),\"\"))","v":""},null,null,{"$f":"IF(E306=\"\",\"\",IF(COUNTIF(E$6:E305,E306)<1,\"初\",IFERROR(VLOOKUP(INDEX(F$1:F305,_xlfn.AGGREGATE(14,6,ROW(E$6:E305)/(E$6:E305=E306),1)),{\"申\",\"　\";\"　\",\"申\"},2,0),\"\")))","v":""},null,null,null,null,null,null,null,null," "]
[null,{"$f":"IF(C307<>1,\"\",1+INDEX(B:B,MATCH(MAX(B$1:B306)+1,B$1:B306, 1)))","v":""},{"$f":"IF(D307=\"\",\"\",IF(D307<D306,IF(1+INDEX(C:C,MATCH(MAX(C$1:C306)+1,C$1:C306, 1))>12,1,1+INDEX(C:C,MATCH(MAX(C$1:C306)+1,C$1:C306, 1))),\"\"))","v":""},null,null,{"$f":"IF(E307=\"\",\"\",IF(COUNTIF(E$6:E306,E307)<1,\"初\",IFERROR(VLOOKUP(INDEX(F$1:F306,_xlfn.AGGREGATE(14,6,ROW(E$6:E306)/(E$6:E306=E307),1)),{\"申\",\"　\";\"　\",\"申\"},2,0),\"\")))","v":""},null,null,null,null,null,null,null,null," "]
[null,{"$f":"IF(C308<>1,\"\",1+INDEX(B:B,MATCH(MAX(B$1:B307)+1,B$1:B307, 1)))","v":""},{"$f":"IF(D308=\"\",\"\",IF(D308<D307,IF(1+INDEX(C:C,MATCH(MAX(C$1:C307)+1,C$1:C307, 1))>12,1,1+INDEX(C:C,MATCH(MAX(C$1:C307)+1,C$1:C307, 1))),\"\"))","v":""},null,null,{"$f":"IF(E308=\"\",\"\",IF(COUNTIF(E$6:E307,E308)<1,\"初\",IFERROR(VLOOKUP(INDEX(F$1:F307,_xlfn.AGGREGATE(14,6,ROW(E$6:E307)/(E$6:E307=E308),1)),{\"申\",\"　\";\"　\",\"申\"},2,0),\"\")))","v":""},null,null,null,null,null,null,null,null," "]
[null,{"$f":"IF(C309<>1,\"\",1+INDEX(B:B,MATCH(MAX(B$1:B308)+1,B$1:B308, 1)))","v":""},{"$f":"IF(D309=\"\",\"\",IF(D309<D308,IF(1+INDEX(C:C,MATCH(MAX(C$1:C308)+1,C$1:C308, 1))>12,1,1+INDEX(C:C,MATCH(MAX(C$1:C308)+1,C$1:C308, 1))),\"\"))","v":""},null,null,{"$f":"IF(E309=\"\",\"\",IF(COUNTIF(E$6:E308,E309)<1,\"初\",IFERROR(VLOOKUP(INDEX(F$1:F308,_xlfn.AGGREGATE(14,6,ROW(E$6:E308)/(E$6:E308=E309),1)),{\"申\",\"　\";\"　\",\"申\"},2,0),\"\")))","v":""},null,null,null,null,null,null,null,null," "]
[null,{"$f":"IF(C310<>1,\"\",1+INDEX(B:B,MATCH(MAX(B$1:B309)+1,B$1:B309, 1)))","v":""},{"$f":"IF(D310=\"\",\"\",IF(D310<D309,IF(1+INDEX(C:C,MATCH(MAX(C$1:C309)+1,C$1:C309, 1))>12,1,1+INDEX(C:C,MATCH(MAX(C$1:C309)+1,C$1:C309, 1))),\"\"))","v":""},null,null,{"$f":"IF(E310=\"\",\"\",IF(COUNTIF(E$6:E309,E310)<1,\"初\",IFERROR(VLOOKUP(INDEX(F$1:F309,_xlfn.AGGREGATE(14,6,ROW(E$6:E309)/(E$6:E309=E310),1)),{\"申\",\"　\";\"　\",\"申\"},2,0),\"\")))","v":""},null,null,null,null,null,null,null,null," "]
[null,{"$f":"IF(C311<>1,\"\",1+INDEX(B:B,MATCH(MAX(B$1:B310)+1,B$1:B310, 1)))","v":""},{"$f":"IF(D311=\"\",\"\",IF(D311<D310,IF(1+INDEX(C:C,MATCH(MAX(C$1:C310)+1,C$1:C310, 1))>12,1,1+INDEX(C:C,MATCH(MAX(C$1:C310)+1,C$1:C310, 1))),\"\"))","v":""},null,null,{"$f":"IF(E311=\"\",\"\",IF(COUNTIF(E$6:E310,E311)<1,\"初\",IFERROR(VLOOKUP(INDEX(F$1:F310,_xlfn.AGGREGATE(14,6,ROW(E$6:E310)/(E$6:E310=E311),1)),{\"申\",\"　\";\"　\",\"申\"},2,0),\"\")))","v":""},null,null,null,null,null,null,null,null," "]
[null,{"$f":"IF(C312<>1,\"\",1+INDEX(B:B,MATCH(MAX(B$1:B311)+1,B$1:B311, 1)))","v":""},{"$f":"IF(D312=\"\",\"\",IF(D312<D311,IF(1+INDEX(C:C,MATCH(MAX(C$1:C311)+1,C$1:C311, 1))>12,1,1+INDEX(C:C,MATCH(MAX(C$1:C311)+1,C$1:C311, 1))),\"\"))","v":""},null,null,{"$f":"IF(E312=\"\",\"\",IF(COUNTIF(E$6:E311,E312)<1,\"初\",IFERROR(VLOOKUP(INDEX(F$1:F311,_xlfn.AGGREGATE(14,6,ROW(E$6:E311)/(E$6:E311=E312),1)),{\"申\",\"　\";\"　\",\"申\"},2,0),\"\")))","v":""},null,null,null,null,null,null,null,null," "]
[null,{"$f":"IF(C313<>1,\"\",1+INDEX(B:B,MATCH(MAX(B$1:B312)+1,B$1:B312, 1)))","v":""},{"$f":"IF(D313=\"\",\"\",IF(D313<D312,IF(1+INDEX(C:C,MATCH(MAX(C$1:C312)+1,C$1:C312, 1))>12,1,1+INDEX(C:C,MATCH(MAX(C$1:C312)+1,C$1:C312, 1))),\"\"))","v":""},null,null,{"$f":"IF(E313=\"\",\"\",IF(COUNTIF(E$6:E312,E313)<1,\"初\",IFERROR(VLOOKUP(INDEX(F$1:F312,_xlfn.AGGREGATE(14,6,ROW(E$6:E312)/(E$6:E312=E313),1)),{\"申\",\"　\";\"　\",\"申\"},2,0),\"\")))","v":""},null,null,null,null,null,null,null,null," "]
[null,{"$f":"IF(C314<>1,\"\",1+INDEX(B:B,MATCH(MAX(B$1:B313)+1,B$1:B313, 1)))","v":""},{"$f":"IF(D314=\"\",\"\",IF(D314<D313,IF(1+INDEX(C:C,MATCH(MAX(C$1:C313)+1,C$1:C313, 1))>12,1,1+INDEX(C:C,MATCH(MAX(C$1:C313)+1,C$1:C313, 1))),\"\"))","v":""},null,null,{"$f":"IF(E314=\"\",\"\",IF(COUNTIF(E$6:E313,E314)<1,\"初\",IFERROR(VLOOKUP(INDEX(F$1:F313,_xlfn.AGGREGATE(14,6,ROW(E$6:E313)/(E$6:E313=E314),1)),{\"申\",\"　\";\"　\",\"申\"},2,0),\"\")))","v":""},null,null,null,null,null,null,null,null," "]
[null,{"$f":"IF(C315<>1,\"\",1+INDEX(B:B,MATCH(MAX(B$1:B314)+1,B$1:B314, 1)))","v":""},{"$f":"IF(D315=\"\",\"\",IF(D315<D314,IF(1+INDEX(C:C,MATCH(MAX(C$1:C314)+1,C$1:C314, 1))>12,1,1+INDEX(C:C,MATCH(MAX(C$1:C314)+1,C$1:C314, 1))),\"\"))","v":""},null,null,{"$f":"IF(E315=\"\",\"\",IF(COUNTIF(E$6:E314,E315)<1,\"初\",IFERROR(VLOOKUP(INDEX(F$1:F314,_xlfn.AGGREGATE(14,6,ROW(E$6:E314)/(E$6:E314=E315),1)),{\"申\",\"　\";\"　\",\"申\"},2,0),\"\")))","v":""},null,null,null,null,null,null,null,null," "]
[null,{"$f":"IF(C316<>1,\"\",1+INDEX(B:B,MATCH(MAX(B$1:B315)+1,B$1:B315, 1)))","v":""},{"$f":"IF(D316=\"\",\"\",IF(D316<D315,IF(1+INDEX(C:C,MATCH(MAX(C$1:C315)+1,C$1:C315, 1))>12,1,1+INDEX(C:C,MATCH(MAX(C$1:C315)+1,C$1:C315, 1))),\"\"))","v":""},null,null,{"$f":"IF(E316=\"\",\"\",IF(COUNTIF(E$6:E315,E316)<1,\"初\",IFERROR(VLOOKUP(INDEX(F$1:F315,_xlfn.AGGREGATE(14,6,ROW(E$6:E315)/(E$6:E315=E316),1)),{\"申\",\"　\";\"　\",\"申\"},2,0),\"\")))","v":""},null,null,null,null,null,null,null,null," "]
[null,{"$f":"IF(C317<>1,\"\",1+INDEX(B:B,MATCH(MAX(B$1:B316)+1,B$1:B316, 1)))","v":""},{"$f":"IF(D317=\"\",\"\",IF(D317<D316,IF(1+INDEX(C:C,MATCH(MAX(C$1:C316)+1,C$1:C316, 1))>12,1,1+INDEX(C:C,MATCH(MAX(C$1:C316)+1,C$1:C316, 1))),\"\"))","v":""},null,null,{"$f":"IF(E317=\"\",\"\",IF(COUNTIF(E$6:E316,E317)<1,\"初\",IFERROR(VLOOKUP(INDEX(F$1:F316,_xlfn.AGGREGATE(14,6,ROW(E$6:E316)/(E$6:E316=E317),1)),{\"申\",\"　\";\"　\",\"申\"},2,0),\"\")))","v":""},null,null,null,null,null,null,null,null," "]
[null,{"$f":"IF(C318<>1,\"\",1+INDEX(B:B,MATCH(MAX(B$1:B317)+1,B$1:B317, 1)))","v":""},{"$f":"IF(D318=\"\",\"\",IF(D318<D317,IF(1+INDEX(C:C,MATCH(MAX(C$1:C317)+1,C$1:C317, 1))>12,1,1+INDEX(C:C,MATCH(MAX(C$1:C317)+1,C$1:C317, 1))),\"\"))","v":""},null,null,{"$f":"IF(E318=\"\",\"\",IF(COUNTIF(E$6:E317,E318)<1,\"初\",IFERROR(VLOOKUP(INDEX(F$1:F317,_xlfn.AGGREGATE(14,6,ROW(E$6:E317)/(E$6:E317=E318),1)),{\"申\",\"　\";\"　\",\"申\"},2,0),\"\")))","v":""},null,null,null,null,null,null,null,null," "]
[null,{"$f":"IF(C319<>1,\"\",1+INDEX(B:B,MATCH(MAX(B$1:B318)+1,B$1:B318, 1)))","v":""},{"$f":"IF(D319=\"\",\"\",IF(D319<D318,IF(1+INDEX(C:C,MATCH(MAX(C$1:C318)+1,C$1:C318, 1))>12,1,1+INDEX(C:C,MATCH(MAX(C$1:C318)+1,C$1:C318, 1))),\"\"))","v":""},null,null,{"$f":"IF(E319=\"\",\"\",IF(COUNTIF(E$6:E318,E319)<1,\"初\",IFERROR(VLOOKUP(INDEX(F$1:F318,_xlfn.AGGREGATE(14,6,ROW(E$6:E318)/(E$6:E318=E319),1)),{\"申\",\"　\";\"　\",\"申\"},2,0),\"\")))","v":""},null,null,null,null,null,null,null,null," "]
[null,{"$f":"IF(C320<>1,\"\",1+INDEX(B:B,MATCH(MAX(B$1:B319)+1,B$1:B319, 1)))","v":""},{"$f":"IF(D320=\"\",\"\",IF(D320<D319,IF(1+INDEX(C:C,MATCH(MAX(C$1:C319)+1,C$1:C319, 1))>12,1,1+INDEX(C:C,MATCH(MAX(C$1:C319)+1,C$1:C319, 1))),\"\"))","v":""},null,null,{"$f":"IF(E320=\"\",\"\",IF(COUNTIF(E$6:E319,E320)<1,\"初\",IFERROR(VLOOKUP(INDEX(F$1:F319,_xlfn.AGGREGATE(14,6,ROW(E$6:E319)/(E$6:E319=E320),1)),{\"申\",\"　\";\"　\",\"申\"},2,0),\"\")))","v":""},null,null,null,null,null,null,null,null," "]
[null,{"$f":"IF(C321<>1,\"\",1+INDEX(B:B,MATCH(MAX(B$1:B320)+1,B$1:B320, 1)))","v":""},{"$f":"IF(D321=\"\",\"\",IF(D321<D320,IF(1+INDEX(C:C,MATCH(MAX(C$1:C320)+1,C$1:C320, 1))>12,1,1+INDEX(C:C,MATCH(MAX(C$1:C320)+1,C$1:C320, 1))),\"\"))","v":""},null,null,{"$f":"IF(E321=\"\",\"\",IF(COUNTIF(E$6:E320,E321)<1,\"初\",IFERROR(VLOOKUP(INDEX(F$1:F320,_xlfn.AGGREGATE(14,6,ROW(E$6:E320)/(E$6:E320=E321),1)),{\"申\",\"　\";\"　\",\"申\"},2,0),\"\")))","v":""},null,null,null,null,null,null,null,null," "]
[null,{"$f":"IF(C322<>1,\"\",1+INDEX(B:B,MATCH(MAX(B$1:B321)+1,B$1:B321, 1)))","v":""},{"$f":"IF(D322=\"\",\"\",IF(D322<D321,IF(1+INDEX(C:C,MATCH(MAX(C$1:C321)+1,C$1:C321, 1))>12,1,1+INDEX(C:C,MATCH(MAX(C$1:C321)+1,C$1:C321, 1))),\"\"))","v":""},null,null,{"$f":"IF(E322=\"\",\"\",IF(COUNTIF(E$6:E321,E322)<1,\"初\",IFERROR(VLOOKUP(INDEX(F$1:F321,_xlfn.AGGREGATE(14,6,ROW(E$6:E321)/(E$6:E321=E322),1)),{\"申\",\"　\";\"　\",\"申\"},2,0),\"\")))","v":""},null,null,null,null,null,null,null,null," "]
[null,{"$f":"IF(C323<>1,\"\",1+INDEX(B:B,MATCH(MAX(B$1:B322)+1,B$1:B322, 1)))","v":""},{"$f":"IF(D323=\"\",\"\",IF(D323<D322,IF(1+INDEX(C:C,MATCH(MAX(C$1:C322)+1,C$1:C322, 1))>12,1,1+INDEX(C:C,MATCH(MAX(C$1:C322)+1,C$1:C322, 1))),\"\"))","v":""},null,null,{"$f":"IF(E323=\"\",\"\",IF(COUNTIF(E$6:E322,E323)<1,\"初\",IFERROR(VLOOKUP(INDEX(F$1:F322,_xlfn.AGGREGATE(14,6,ROW(E$6:E322)/(E$6:E322=E323),1)),{\"申\",\"　\";\"　\",\"申\"},2,0),\"\")))","v":""},null,null,null,null,null,null,null,null," "]
[null,{"$f":"IF(C324<>1,\"\",1+INDEX(B:B,MATCH(MAX(B$1:B323)+1,B$1:B323, 1)))","v":""},{"$f":"IF(D324=\"\",\"\",IF(D324<D323,IF(1+INDEX(C:C,MATCH(MAX(C$1:C323)+1,C$1:C323, 1))>12,1,1+INDEX(C:C,MATCH(MAX(C$1:C323)+1,C$1:C323, 1))),\"\"))","v":""},null,null,{"$f":"IF(E324=\"\",\"\",IF(COUNTIF(E$6:E323,E324)<1,\"初\",IFERROR(VLOOKUP(INDEX(F$1:F323,_xlfn.AGGREGATE(14,6,ROW(E$6:E323)/(E$6:E323=E324),1)),{\"申\",\"　\";\"　\",\"申\"},2,0),\"\")))","v":""},null,null,null,null,null,null,null,null," "]
[null,{"$f":"IF(C325<>1,\"\",1+INDEX(B:B,MATCH(MAX(B$1:B324)+1,B$1:B324, 1)))","v":""},{"$f":"IF(D325=\"\",\"\",IF(D325<D324,IF(1+INDEX(C:C,MATCH(MAX(C$1:C324)+1,C$1:C324, 1))>12,1,1+INDEX(C:C,MATCH(MAX(C$1:C324)+1,C$1:C324, 1))),\"\"))","v":""},null,null,{"$f":"IF(E325=\"\",\"\",IF(COUNTIF(E$6:E324,E325)<1,\"初\",IFERROR(VLOOKUP(INDEX(F$1:F324,_xlfn.AGGREGATE(14,6,ROW(E$6:E324)/(E$6:E324=E325),1)),{\"申\",\"　\";\"　\",\"申\"},2,0),\"\")))","v":""},null,null,null,null,null,null,null,null," "]
[null,{"$f":"IF(C326<>1,\"\",1+INDEX(B:B,MATCH(MAX(B$1:B325)+1,B$1:B325, 1)))","v":""},{"$f":"IF(D326=\"\",\"\",IF(D326<D325,IF(1+INDEX(C:C,MATCH(MAX(C$1:C325)+1,C$1:C325, 1))>12,1,1+INDEX(C:C,MATCH(MAX(C$1:C325)+1,C$1:C325, 1))),\"\"))","v":""},null,null,{"$f":"IF(E326=\"\",\"\",IF(COUNTIF(E$6:E325,E326)<1,\"初\",IFERROR(VLOOKUP(INDEX(F$1:F325,_xlfn.AGGREGATE(14,6,ROW(E$6:E325)/(E$6:E325=E326),1)),{\"申\",\"　\";\"　\",\"申\"},2,0),\"\")))","v":""},null,null,null,null,null,null,null,null," "]
[null,{"$f":"IF(C327<>1,\"\",1+INDEX(B:B,MATCH(MAX(B$1:B326)+1,B$1:B326, 1)))","v":""},{"$f":"IF(D327=\"\",\"\",IF(D327<D326,IF(1+INDEX(C:C,MATCH(MAX(C$1:C326)+1,C$1:C326, 1))>12,1,1+INDEX(C:C,MATCH(MAX(C$1:C326)+1,C$1:C326, 1))),\"\"))","v":""},null,null,{"$f":"IF(E327=\"\",\"\",IF(COUNTIF(E$6:E326,E327)<1,\"初\",IFERROR(VLOOKUP(INDEX(F$1:F326,_xlfn.AGGREGATE(14,6,ROW(E$6:E326)/(E$6:E326=E327),1)),{\"申\",\"　\";\"　\",\"申\"},2,0),\"\")))","v":""},null,null,null,null,null,null,null,null," "]
[null,{"$f":"IF(C328<>1,\"\",1+INDEX(B:B,MATCH(MAX(B$1:B327)+1,B$1:B327, 1)))","v":""},{"$f":"IF(D328=\"\",\"\",IF(D328<D327,IF(1+INDEX(C:C,MATCH(MAX(C$1:C327)+1,C$1:C327, 1))>12,1,1+INDEX(C:C,MATCH(MAX(C$1:C327)+1,C$1:C327, 1))),\"\"))","v":""},null,null,{"$f":"IF(E328=\"\",\"\",IF(COUNTIF(E$6:E327,E328)<1,\"初\",IFERROR(VLOOKUP(INDEX(F$1:F327,_xlfn.AGGREGATE(14,6,ROW(E$6:E327)/(E$6:E327=E328),1)),{\"申\",\"　\";\"　\",\"申\"},2,0),\"\")))","v":""},null,null,null,null,null,null,null,null," "]
[null,{"$f":"IF(C329<>1,\"\",1+INDEX(B:B,MATCH(MAX(B$1:B328)+1,B$1:B328, 1)))","v":""},{"$f":"IF(D329=\"\",\"\",IF(D329<D328,IF(1+INDEX(C:C,MATCH(MAX(C$1:C328)+1,C$1:C328, 1))>12,1,1+INDEX(C:C,MATCH(MAX(C$1:C328)+1,C$1:C328, 1))),\"\"))","v":""},null,null,{"$f":"IF(E329=\"\",\"\",IF(COUNTIF(E$6:E328,E329)<1,\"初\",IFERROR(VLOOKUP(INDEX(F$1:F328,_xlfn.AGGREGATE(14,6,ROW(E$6:E328)/(E$6:E328=E329),1)),{\"申\",\"　\";\"　\",\"申\"},2,0),\"\")))","v":""},null,null,null,null,null,null,null,null," "]
[null,{"$f":"IF(C330<>1,\"\",1+INDEX(B:B,MATCH(MAX(B$1:B329)+1,B$1:B329, 1)))","v":""},{"$f":"IF(D330=\"\",\"\",IF(D330<D329,IF(1+INDEX(C:C,MATCH(MAX(C$1:C329)+1,C$1:C329, 1))>12,1,1+INDEX(C:C,MATCH(MAX(C$1:C329)+1,C$1:C329, 1))),\"\"))","v":""},null,null,{"$f":"IF(E330=\"\",\"\",IF(COUNTIF(E$6:E329,E330)<1,\"初\",IFERROR(VLOOKUP(INDEX(F$1:F329,_xlfn.AGGREGATE(14,6,ROW(E$6:E329)/(E$6:E329=E330),1)),{\"申\",\"　\";\"　\",\"申\"},2,0),\"\")))","v":""},null,null,null,null,null,null,null,null," "]
[null,{"$f":"IF(C331<>1,\"\",1+INDEX(B:B,MATCH(MAX(B$1:B330)+1,B$1:B330, 1)))","v":""},{"$f":"IF(D331=\"\",\"\",IF(D331<D330,IF(1+INDEX(C:C,MATCH(MAX(C$1:C330)+1,C$1:C330, 1))>12,1,1+INDEX(C:C,MATCH(MAX(C$1:C330)+1,C$1:C330, 1))),\"\"))","v":""},null,null,{"$f":"IF(E331=\"\",\"\",IF(COUNTIF(E$6:E330,E331)<1,\"初\",IFERROR(VLOOKUP(INDEX(F$1:F330,_xlfn.AGGREGATE(14,6,ROW(E$6:E330)/(E$6:E330=E331),1)),{\"申\",\"　\";\"　\",\"申\"},2,0),\"\")))","v":""},null,null,null,null,null,null,null,null," "]
[null,{"$f":"IF(C332<>1,\"\",1+INDEX(B:B,MATCH(MAX(B$1:B331)+1,B$1:B331, 1)))","v":""},{"$f":"IF(D332=\"\",\"\",IF(D332<D331,IF(1+INDEX(C:C,MATCH(MAX(C$1:C331)+1,C$1:C331, 1))>12,1,1+INDEX(C:C,MATCH(MAX(C$1:C331)+1,C$1:C331, 1))),\"\"))","v":""},null,null,{"$f":"IF(E332=\"\",\"\",IF(COUNTIF(E$6:E331,E332)<1,\"初\",IFERROR(VLOOKUP(INDEX(F$1:F331,_xlfn.AGGREGATE(14,6,ROW(E$6:E331)/(E$6:E331=E332),1)),{\"申\",\"　\";\"　\",\"申\"},2,0),\"\")))","v":""},null,null,null,null,null,null,null,null," "]
[null,{"$f":"IF(C333<>1,\"\",1+INDEX(B:B,MATCH(MAX(B$1:B332)+1,B$1:B332, 1)))","v":""},{"$f":"IF(D333=\"\",\"\",IF(D333<D332,IF(1+INDEX(C:C,MATCH(MAX(C$1:C332)+1,C$1:C332, 1))>12,1,1+INDEX(C:C,MATCH(MAX(C$1:C332)+1,C$1:C332, 1))),\"\"))","v":""},null,null,{"$f":"IF(E333=\"\",\"\",IF(COUNTIF(E$6:E332,E333)<1,\"初\",IFERROR(VLOOKUP(INDEX(F$1:F332,_xlfn.AGGREGATE(14,6,ROW(E$6:E332)/(E$6:E332=E333),1)),{\"申\",\"　\";\"　\",\"申\"},2,0),\"\")))","v":""},null,null,null,null,null,null,null,null," "]
[null,{"$f":"IF(C334<>1,\"\",1+INDEX(B:B,MATCH(MAX(B$1:B333)+1,B$1:B333, 1)))","v":""},{"$f":"IF(D334=\"\",\"\",IF(D334<D333,IF(1+INDEX(C:C,MATCH(MAX(C$1:C333)+1,C$1:C333, 1))>12,1,1+INDEX(C:C,MATCH(MAX(C$1:C333)+1,C$1:C333, 1))),\"\"))","v":""},null,null,{"$f":"IF(E334=\"\",\"\",IF(COUNTIF(E$6:E333,E334)<1,\"初\",IFERROR(VLOOKUP(INDEX(F$1:F333,_xlfn.AGGREGATE(14,6,ROW(E$6:E333)/(E$6:E333=E334),1)),{\"申\",\"　\";\"　\",\"申\"},2,0),\"\")))","v":""},null,null,null,null,null,null,null,null," "]
[null,{"$f":"IF(C335<>1,\"\",1+INDEX(B:B,MATCH(MAX(B$1:B334)+1,B$1:B334, 1)))","v":""},{"$f":"IF(D335=\"\",\"\",IF(D335<D334,IF(1+INDEX(C:C,MATCH(MAX(C$1:C334)+1,C$1:C334, 1))>12,1,1+INDEX(C:C,MATCH(MAX(C$1:C334)+1,C$1:C334, 1))),\"\"))","v":""},null,null,{"$f":"IF(E335=\"\",\"\",IF(COUNTIF(E$6:E334,E335)<1,\"初\",IFERROR(VLOOKUP(INDEX(F$1:F334,_xlfn.AGGREGATE(14,6,ROW(E$6:E334)/(E$6:E334=E335),1)),{\"申\",\"　\";\"　\",\"申\"},2,0),\"\")))","v":""},null,null,null,null,null,null,null,null," "]
[null,{"$f":"IF(C336<>1,\"\",1+INDEX(B:B,MATCH(MAX(B$1:B335)+1,B$1:B335, 1)))","v":""},{"$f":"IF(D336=\"\",\"\",IF(D336<D335,IF(1+INDEX(C:C,MATCH(MAX(C$1:C335)+1,C$1:C335, 1))>12,1,1+INDEX(C:C,MATCH(MAX(C$1:C335)+1,C$1:C335, 1))),\"\"))","v":""},null,null,{"$f":"IF(E336=\"\",\"\",IF(COUNTIF(E$6:E335,E336)<1,\"初\",IFERROR(VLOOKUP(INDEX(F$1:F335,_xlfn.AGGREGATE(14,6,ROW(E$6:E335)/(E$6:E335=E336),1)),{\"申\",\"　\";\"　\",\"申\"},2,0),\"\")))","v":""},null,null,null,null,null,null,null,null," "]
[null,{"$f":"IF(C337<>1,\"\",1+INDEX(B:B,MATCH(MAX(B$1:B336)+1,B$1:B336, 1)))","v":""},{"$f":"IF(D337=\"\",\"\",IF(D337<D336,IF(1+INDEX(C:C,MATCH(MAX(C$1:C336)+1,C$1:C336, 1))>12,1,1+INDEX(C:C,MATCH(MAX(C$1:C336)+1,C$1:C336, 1))),\"\"))","v":""},null,null,{"$f":"IF(E337=\"\",\"\",IF(COUNTIF(E$6:E336,E337)<1,\"初\",IFERROR(VLOOKUP(INDEX(F$1:F336,_xlfn.AGGREGATE(14,6,ROW(E$6:E336)/(E$6:E336=E337),1)),{\"申\",\"　\";\"　\",\"申\"},2,0),\"\")))","v":""},null,null,null,null,null,null,null,null," "]
[null,{"$f":"IF(C338<>1,\"\",1+INDEX(B:B,MATCH(MAX(B$1:B337)+1,B$1:B337, 1)))","v":""},{"$f":"IF(D338=\"\",\"\",IF(D338<D337,IF(1+INDEX(C:C,MATCH(MAX(C$1:C337)+1,C$1:C337, 1))>12,1,1+INDEX(C:C,MATCH(MAX(C$1:C337)+1,C$1:C337, 1))),\"\"))","v":""},null,null,{"$f":"IF(E338=\"\",\"\",IF(COUNTIF(E$6:E337,E338)<1,\"初\",IFERROR(VLOOKUP(INDEX(F$1:F337,_xlfn.AGGREGATE(14,6,ROW(E$6:E337)/(E$6:E337=E338),1)),{\"申\",\"　\";\"　\",\"申\"},2,0),\"\")))","v":""},null,null,null,null,null,null,null,null," "]
[null,{"$f":"IF(C339<>1,\"\",1+INDEX(B:B,MATCH(MAX(B$1:B338)+1,B$1:B338, 1)))","v":""},{"$f":"IF(D339=\"\",\"\",IF(D339<D338,IF(1+INDEX(C:C,MATCH(MAX(C$1:C338)+1,C$1:C338, 1))>12,1,1+INDEX(C:C,MATCH(MAX(C$1:C338)+1,C$1:C338, 1))),\"\"))","v":""},null,null,{"$f":"IF(E339=\"\",\"\",IF(COUNTIF(E$6:E338,E339)<1,\"初\",IFERROR(VLOOKUP(INDEX(F$1:F338,_xlfn.AGGREGATE(14,6,ROW(E$6:E338)/(E$6:E338=E339),1)),{\"申\",\"　\";\"　\",\"申\"},2,0),\"\")))","v":""},null,null,null,null,null,null,null,null," "]
[null,{"$f":"IF(C340<>1,\"\",1+INDEX(B:B,MATCH(MAX(B$1:B339)+1,B$1:B339, 1)))","v":""},{"$f":"IF(D340=\"\",\"\",IF(D340<D339,IF(1+INDEX(C:C,MATCH(MAX(C$1:C339)+1,C$1:C339, 1))>12,1,1+INDEX(C:C,MATCH(MAX(C$1:C339)+1,C$1:C339, 1))),\"\"))","v":""},null,null,{"$f":"IF(E340=\"\",\"\",IF(COUNTIF(E$6:E339,E340)<1,\"初\",IFERROR(VLOOKUP(INDEX(F$1:F339,_xlfn.AGGREGATE(14,6,ROW(E$6:E339)/(E$6:E339=E340),1)),{\"申\",\"　\";\"　\",\"申\"},2,0),\"\")))","v":""},null,null,null,null,null,null,null,null," "]
[null,{"$f":"IF(C341<>1,\"\",1+INDEX(B:B,MATCH(MAX(B$1:B340)+1,B$1:B340, 1)))","v":""},{"$f":"IF(D341=\"\",\"\",IF(D341<D340,IF(1+INDEX(C:C,MATCH(MAX(C$1:C340)+1,C$1:C340, 1))>12,1,1+INDEX(C:C,MATCH(MAX(C$1:C340)+1,C$1:C340, 1))),\"\"))","v":""},null,null,{"$f":"IF(E341=\"\",\"\",IF(COUNTIF(E$6:E340,E341)<1,\"初\",IFERROR(VLOOKUP(INDEX(F$1:F340,_xlfn.AGGREGATE(14,6,ROW(E$6:E340)/(E$6:E340=E341),1)),{\"申\",\"　\";\"　\",\"申\"},2,0),\"\")))","v":""},null,null,null,null,null,null,null,null," "]
[null,{"$f":"IF(C342<>1,\"\",1+INDEX(B:B,MATCH(MAX(B$1:B341)+1,B$1:B341, 1)))","v":""},{"$f":"IF(D342=\"\",\"\",IF(D342<D341,IF(1+INDEX(C:C,MATCH(MAX(C$1:C341)+1,C$1:C341, 1))>12,1,1+INDEX(C:C,MATCH(MAX(C$1:C341)+1,C$1:C341, 1))),\"\"))","v":""},null,null,{"$f":"IF(E342=\"\",\"\",IF(COUNTIF(E$6:E341,E342)<1,\"初\",IFERROR(VLOOKUP(INDEX(F$1:F341,_xlfn.AGGREGATE(14,6,ROW(E$6:E341)/(E$6:E341=E342),1)),{\"申\",\"　\";\"　\",\"申\"},2,0),\"\")))","v":""},null,null,null,null,null,null,null,null," "]
[null,{"$f":"IF(C343<>1,\"\",1+INDEX(B:B,MATCH(MAX(B$1:B342)+1,B$1:B342, 1)))","v":""},{"$f":"IF(D343=\"\",\"\",IF(D343<D342,IF(1+INDEX(C:C,MATCH(MAX(C$1:C342)+1,C$1:C342, 1))>12,1,1+INDEX(C:C,MATCH(MAX(C$1:C342)+1,C$1:C342, 1))),\"\"))","v":""},null,null,{"$f":"IF(E343=\"\",\"\",IF(COUNTIF(E$6:E342,E343)<1,\"初\",IFERROR(VLOOKUP(INDEX(F$1:F342,_xlfn.AGGREGATE(14,6,ROW(E$6:E342)/(E$6:E342=E343),1)),{\"申\",\"　\";\"　\",\"申\"},2,0),\"\")))","v":""},null,null,null,null,null,null,null,null," "]
[null,{"$f":"IF(C344<>1,\"\",1+INDEX(B:B,MATCH(MAX(B$1:B343)+1,B$1:B343, 1)))","v":""},{"$f":"IF(D344=\"\",\"\",IF(D344<D343,IF(1+INDEX(C:C,MATCH(MAX(C$1:C343)+1,C$1:C343, 1))>12,1,1+INDEX(C:C,MATCH(MAX(C$1:C343)+1,C$1:C343, 1))),\"\"))","v":""},null,null,{"$f":"IF(E344=\"\",\"\",IF(COUNTIF(E$6:E343,E344)<1,\"初\",IFERROR(VLOOKUP(INDEX(F$1:F343,_xlfn.AGGREGATE(14,6,ROW(E$6:E343)/(E$6:E343=E344),1)),{\"申\",\"　\";\"　\",\"申\"},2,0),\"\")))","v":""},null,null,null,null,null,null,null,null," "]
[null,{"$f":"IF(C345<>1,\"\",1+INDEX(B:B,MATCH(MAX(B$1:B344)+1,B$1:B344, 1)))","v":""},{"$f":"IF(D345=\"\",\"\",IF(D345<D344,IF(1+INDEX(C:C,MATCH(MAX(C$1:C344)+1,C$1:C344, 1))>12,1,1+INDEX(C:C,MATCH(MAX(C$1:C344)+1,C$1:C344, 1))),\"\"))","v":""},null,null,{"$f":"IF(E345=\"\",\"\",IF(COUNTIF(E$6:E344,E345)<1,\"初\",IFERROR(VLOOKUP(INDEX(F$1:F344,_xlfn.AGGREGATE(14,6,ROW(E$6:E344)/(E$6:E344=E345),1)),{\"申\",\"　\";\"　\",\"申\"},2,0),\"\")))","v":""},null,null,null,null,null,null,null,null," "]
[null,{"$f":"IF(C346<>1,\"\",1+INDEX(B:B,MATCH(MAX(B$1:B345)+1,B$1:B345, 1)))","v":""},{"$f":"IF(D346=\"\",\"\",IF(D346<D345,IF(1+INDEX(C:C,MATCH(MAX(C$1:C345)+1,C$1:C345, 1))>12,1,1+INDEX(C:C,MATCH(MAX(C$1:C345)+1,C$1:C345, 1))),\"\"))","v":""},null,null,{"$f":"IF(E346=\"\",\"\",IF(COUNTIF(E$6:E345,E346)<1,\"初\",IFERROR(VLOOKUP(INDEX(F$1:F345,_xlfn.AGGREGATE(14,6,ROW(E$6:E345)/(E$6:E345=E346),1)),{\"申\",\"　\";\"　\",\"申\"},2,0),\"\")))","v":""},null,null,null,null,null,null,null,null," "]
[null,{"$f":"IF(C347<>1,\"\",1+INDEX(B:B,MATCH(MAX(B$1:B346)+1,B$1:B346, 1)))","v":""},{"$f":"IF(D347=\"\",\"\",IF(D347<D346,IF(1+INDEX(C:C,MATCH(MAX(C$1:C346)+1,C$1:C346, 1))>12,1,1+INDEX(C:C,MATCH(MAX(C$1:C346)+1,C$1:C346, 1))),\"\"))","v":""},null,null,{"$f":"IF(E347=\"\",\"\",IF(COUNTIF(E$6:E346,E347)<1,\"初\",IFERROR(VLOOKUP(INDEX(F$1:F346,_xlfn.AGGREGATE(14,6,ROW(E$6:E346)/(E$6:E346=E347),1)),{\"申\",\"　\";\"　\",\"申\"},2,0),\"\")))","v":""},null,null,null,null,null,null,null,null," "]
[null,{"$f":"IF(C348<>1,\"\",1+INDEX(B:B,MATCH(MAX(B$1:B347)+1,B$1:B347, 1)))","v":""},{"$f":"IF(D348=\"\",\"\",IF(D348<D347,IF(1+INDEX(C:C,MATCH(MAX(C$1:C347)+1,C$1:C347, 1))>12,1,1+INDEX(C:C,MATCH(MAX(C$1:C347)+1,C$1:C347, 1))),\"\"))","v":""},null,null,{"$f":"IF(E348=\"\",\"\",IF(COUNTIF(E$6:E347,E348)<1,\"初\",IFERROR(VLOOKUP(INDEX(F$1:F347,_xlfn.AGGREGATE(14,6,ROW(E$6:E347)/(E$6:E347=E348),1)),{\"申\",\"　\";\"　\",\"申\"},2,0),\"\")))","v":""},null,null,null,null,null,null,null,null," "]
[null,{"$f":"IF(C349<>1,\"\",1+INDEX(B:B,MATCH(MAX(B$1:B348)+1,B$1:B348, 1)))","v":""},{"$f":"IF(D349=\"\",\"\",IF(D349<D348,IF(1+INDEX(C:C,MATCH(MAX(C$1:C348)+1,C$1:C348, 1))>12,1,1+INDEX(C:C,MATCH(MAX(C$1:C348)+1,C$1:C348, 1))),\"\"))","v":""},null,null,{"$f":"IF(E349=\"\",\"\",IF(COUNTIF(E$6:E348,E349)<1,\"初\",IFERROR(VLOOKUP(INDEX(F$1:F348,_xlfn.AGGREGATE(14,6,ROW(E$6:E348)/(E$6:E348=E349),1)),{\"申\",\"　\";\"　\",\"申\"},2,0),\"\")))","v":""},null,null,null,null,null,null,null,null," "]
[null,{"$f":"IF(C350<>1,\"\",1+INDEX(B:B,MATCH(MAX(B$1:B349)+1,B$1:B349, 1)))","v":""},{"$f":"IF(D350=\"\",\"\",IF(D350<D349,IF(1+INDEX(C:C,MATCH(MAX(C$1:C349)+1,C$1:C349, 1))>12,1,1+INDEX(C:C,MATCH(MAX(C$1:C349)+1,C$1:C349, 1))),\"\"))","v":""},null,null,{"$f":"IF(E350=\"\",\"\",IF(COUNTIF(E$6:E349,E350)<1,\"初\",IFERROR(VLOOKUP(INDEX(F$1:F349,_xlfn.AGGREGATE(14,6,ROW(E$6:E349)/(E$6:E349=E350),1)),{\"申\",\"　\";\"　\",\"申\"},2,0),\"\")))","v":""},null,null,null,null,null,null,null,null," "]
[null,{"$f":"IF(C351<>1,\"\",1+INDEX(B:B,MATCH(MAX(B$1:B350)+1,B$1:B350, 1)))","v":""},{"$f":"IF(D351=\"\",\"\",IF(D351<D350,IF(1+INDEX(C:C,MATCH(MAX(C$1:C350)+1,C$1:C350, 1))>12,1,1+INDEX(C:C,MATCH(MAX(C$1:C350)+1,C$1:C350, 1))),\"\"))","v":""},null,null,{"$f":"IF(E351=\"\",\"\",IF(COUNTIF(E$6:E350,E351)<1,\"初\",IFERROR(VLOOKUP(INDEX(F$1:F350,_xlfn.AGGREGATE(14,6,ROW(E$6:E350)/(E$6:E350=E351),1)),{\"申\",\"　\";\"　\",\"申\"},2,0),\"\")))","v":""},null,null,null,null,null,null,null,null,{"$f":"IF(ISERROR(LEFT(E351,FIND(\"　\",E351,1)-1)&\" \"&LEFT(G351,FIND(\"　\",G351,1)-1)&\" \"&K351&L351&\" \"&H351&IF(I351<>\"\",\"or\"&I351,\"\")&J351&M351&N351), \"\", LEFT(E351,FIND(\"　\",E351,1)-1)&\" \"&LEFT(G351,FIND(\"　\",G351,1)-1)&\" \"&K351&L351&\" \"&H351&IF(I351<>\"\",\"or\"&I351,\"\")&J351&M351&N351)&\" \"&F351","v":" "}]
[null,{"$f":"IF(C352<>1,\"\",1+INDEX(B:B,MATCH(MAX(B$1:B351)+1,B$1:B351, 1)))","v":""},{"$f":"IF(D352=\"\",\"\",IF(D352<D351,IF(1+INDEX(C:C,MATCH(MAX(C$1:C351)+1,C$1:C351, 1))>12,1,1+INDEX(C:C,MATCH(MAX(C$1:C351)+1,C$1:C351, 1))),\"\"))","v":""},null,null,{"$f":"IF(E352=\"\",\"\",IF(COUNTIF(E$6:E351,E352)<1,\"初\",IFERROR(VLOOKUP(INDEX(F$1:F351,_xlfn.AGGREGATE(14,6,ROW(E$6:E351)/(E$6:E351=E352),1)),{\"申\",\"　\";\"　\",\"申\"},2,0),\"\")))","v":""},null,null,null,null,null,null,null,null," "]
[null,{"$f":"IF(C353<>1,\"\",1+INDEX(B:B,MATCH(MAX(B$1:B352)+1,B$1:B352, 1)))","v":""},{"$f":"IF(D353=\"\",\"\",IF(D353<D352,IF(1+INDEX(C:C,MATCH(MAX(C$1:C352)+1,C$1:C352, 1))>12,1,1+INDEX(C:C,MATCH(MAX(C$1:C352)+1,C$1:C352, 1))),\"\"))","v":""},null,null,{"$f":"IF(E353=\"\",\"\",IF(COUNTIF(E$6:E352,E353)<1,\"初\",IFERROR(VLOOKUP(INDEX(F$1:F352,_xlfn.AGGREGATE(14,6,ROW(E$6:E352)/(E$6:E352=E353),1)),{\"申\",\"　\";\"　\",\"申\"},2,0),\"\")))","v":""},null,null,null,null,null,null,null,null," "]
[null,{"$f":"IF(C354<>1,\"\",1+INDEX(B:B,MATCH(MAX(B$1:B353)+1,B$1:B353, 1)))","v":""},{"$f":"IF(D354=\"\",\"\",IF(D354<D353,IF(1+INDEX(C:C,MATCH(MAX(C$1:C353)+1,C$1:C353, 1))>12,1,1+INDEX(C:C,MATCH(MAX(C$1:C353)+1,C$1:C353, 1))),\"\"))","v":""},null,null,{"$f":"IF(E354=\"\",\"\",IF(COUNTIF(E$6:E353,E354)<1,\"初\",IFERROR(VLOOKUP(INDEX(F$1:F353,_xlfn.AGGREGATE(14,6,ROW(E$6:E353)/(E$6:E353=E354),1)),{\"申\",\"　\";\"　\",\"申\"},2,0),\"\")))","v":""},null,null,null,null,null,null,null,null," "]
[null,{"$f":"IF(C355<>1,\"\",1+INDEX(B:B,MATCH(MAX(B$1:B354)+1,B$1:B354, 1)))","v":""},{"$f":"IF(D355=\"\",\"\",IF(D355<D354,IF(1+INDEX(C:C,MATCH(MAX(C$1:C354)+1,C$1:C354, 1))>12,1,1+INDEX(C:C,MATCH(MAX(C$1:C354)+1,C$1:C354, 1))),\"\"))","v":""},null,null,{"$f":"IF(E355=\"\",\"\",IF(COUNTIF(E$6:E354,E355)<1,\"初\",IFERROR(VLOOKUP(INDEX(F$1:F354,_xlfn.AGGREGATE(14,6,ROW(E$6:E354)/(E$6:E354=E355),1)),{\"申\",\"　\";\"　\",\"申\"},2,0),\"\")))","v":""},null,null,null,null,null,null,null,null," "]
[null,{"$f":"IF(C356<>1,\"\",1+INDEX(B:B,MATCH(MAX(B$1:B355)+1,B$1:B355, 1)))","v":""},{"$f":"IF(D356=\"\",\"\",IF(D356<D355,IF(1+INDEX(C:C,MATCH(MAX(C$1:C355)+1,C$1:C355, 1))>12,1,1+INDEX(C:C,MATCH(MAX(C$1:C355)+1,C$1:C355, 1))),\"\"))","v":""},null,null,{"$f":"IF(E356=\"\",\"\",IF(COUNTIF(E$6:E355,E356)<1,\"初\",IFERROR(VLOOKUP(INDEX(F$1:F355,_xlfn.AGGREGATE(14,6,ROW(E$6:E355)/(E$6:E355=E356),1)),{\"申\",\"　\";\"　\",\"申\"},2,0),\"\")))","v":""},null,null,null,null,null,null,null,null," "]
[null,{"$f":"IF(C357<>1,\"\",1+INDEX(B:B,MATCH(MAX(B$1:B356)+1,B$1:B356, 1)))","v":""},{"$f":"IF(D357=\"\",\"\",IF(D357<D356,IF(1+INDEX(C:C,MATCH(MAX(C$1:C356)+1,C$1:C356, 1))>12,1,1+INDEX(C:C,MATCH(MAX(C$1:C356)+1,C$1:C356, 1))),\"\"))","v":""},null,null,{"$f":"IF(E357=\"\",\"\",IF(COUNTIF(E$6:E356,E357)<1,\"初\",IFERROR(VLOOKUP(INDEX(F$1:F356,_xlfn.AGGREGATE(14,6,ROW(E$6:E356)/(E$6:E356=E357),1)),{\"申\",\"　\";\"　\",\"申\"},2,0),\"\")))","v":""},null,null,null,null,null,null,null,null," "]
[null,{"$f":"IF(C358<>1,\"\",1+INDEX(B:B,MATCH(MAX(B$1:B357)+1,B$1:B357, 1)))","v":""},{"$f":"IF(D358=\"\",\"\",IF(D358<D357,IF(1+INDEX(C:C,MATCH(MAX(C$1:C357)+1,C$1:C357, 1))>12,1,1+INDEX(C:C,MATCH(MAX(C$1:C357)+1,C$1:C357, 1))),\"\"))","v":""},null,null,{"$f":"IF(E358=\"\",\"\",IF(COUNTIF(E$6:E357,E358)<1,\"初\",IFERROR(VLOOKUP(INDEX(F$1:F357,_xlfn.AGGREGATE(14,6,ROW(E$6:E357)/(E$6:E357=E358),1)),{\"申\",\"　\";\"　\",\"申\"},2,0),\"\")))","v":""},null,null,null,null,null,null,null,null," "]
[null,{"$f":"IF(C359<>1,\"\",1+INDEX(B:B,MATCH(MAX(B$1:B358)+1,B$1:B358, 1)))","v":""},{"$f":"IF(D359=\"\",\"\",IF(D359<D358,IF(1+INDEX(C:C,MATCH(MAX(C$1:C358)+1,C$1:C358, 1))>12,1,1+INDEX(C:C,MATCH(MAX(C$1:C358)+1,C$1:C358, 1))),\"\"))","v":""},null,null,{"$f":"IF(E359=\"\",\"\",IF(COUNTIF(E$6:E358,E359)<1,\"初\",IFERROR(VLOOKUP(INDEX(F$1:F358,_xlfn.AGGREGATE(14,6,ROW(E$6:E358)/(E$6:E358=E359),1)),{\"申\",\"　\";\"　\",\"申\"},2,0),\"\")))","v":""},null,null,null,null,null,null,null,null," "]
[null,{"$f":"IF(C360<>1,\"\",1+INDEX(B:B,MATCH(MAX(B$1:B359)+1,B$1:B359, 1)))","v":""},{"$f":"IF(D360=\"\",\"\",IF(D360<D359,IF(1+INDEX(C:C,MATCH(MAX(C$1:C359)+1,C$1:C359, 1))>12,1,1+INDEX(C:C,MATCH(MAX(C$1:C359)+1,C$1:C359, 1))),\"\"))","v":""},null,null,{"$f":"IF(E360=\"\",\"\",IF(COUNTIF(E$6:E359,E360)<1,\"初\",IFERROR(VLOOKUP(INDEX(F$1:F359,_xlfn.AGGREGATE(14,6,ROW(E$6:E359)/(E$6:E359=E360),1)),{\"申\",\"　\";\"　\",\"申\"},2,0),\"\")))","v":""},null,null,null,null,null,null,null,null," "]
[null,{"$f":"IF(C361<>1,\"\",1+INDEX(B:B,MATCH(MAX(B$1:B360)+1,B$1:B360, 1)))","v":""},{"$f":"IF(D361=\"\",\"\",IF(D361<D360,IF(1+INDEX(C:C,MATCH(MAX(C$1:C360)+1,C$1:C360, 1))>12,1,1+INDEX(C:C,MATCH(MAX(C$1:C360)+1,C$1:C360, 1))),\"\"))","v":""},null,null,{"$f":"IF(E361=\"\",\"\",IF(COUNTIF(E$6:E360,E361)<1,\"初\",IFERROR(VLOOKUP(INDEX(F$1:F360,_xlfn.AGGREGATE(14,6,ROW(E$6:E360)/(E$6:E360=E361),1)),{\"申\",\"　\";\"　\",\"申\"},2,0),\"\")))","v":""},null,null,null,null,null,null,null,null," "]
[null,{"$f":"IF(C362<>1,\"\",1+INDEX(B:B,MATCH(MAX(B$1:B361)+1,B$1:B361, 1)))","v":""},{"$f":"IF(D362=\"\",\"\",IF(D362<D361,IF(1+INDEX(C:C,MATCH(MAX(C$1:C361)+1,C$1:C361, 1))>12,1,1+INDEX(C:C,MATCH(MAX(C$1:C361)+1,C$1:C361, 1))),\"\"))","v":""},null,null,{"$f":"IF(E362=\"\",\"\",IF(COUNTIF(E$6:E361,E362)<1,\"初\",IFERROR(VLOOKUP(INDEX(F$1:F361,_xlfn.AGGREGATE(14,6,ROW(E$6:E361)/(E$6:E361=E362),1)),{\"申\",\"　\";\"　\",\"申\"},2,0),\"\")))","v":""},null,null,null,null,null,null,null,null," "]
[null,{"$f":"IF(C363<>1,\"\",1+INDEX(B:B,MATCH(MAX(B$1:B362)+1,B$1:B362, 1)))","v":""},{"$f":"IF(D363=\"\",\"\",IF(D363<D362,IF(1+INDEX(C:C,MATCH(MAX(C$1:C362)+1,C$1:C362, 1))>12,1,1+INDEX(C:C,MATCH(MAX(C$1:C362)+1,C$1:C362, 1))),\"\"))","v":""},null,null,{"$f":"IF(E363=\"\",\"\",IF(COUNTIF(E$6:E362,E363)<1,\"初\",IFERROR(VLOOKUP(INDEX(F$1:F362,_xlfn.AGGREGATE(14,6,ROW(E$6:E362)/(E$6:E362=E363),1)),{\"申\",\"　\";\"　\",\"申\"},2,0),\"\")))","v":""},null,null,null,null,null,null,null,null," "]
[null,{"$f":"IF(C364<>1,\"\",1+INDEX(B:B,MATCH(MAX(B$1:B363)+1,B$1:B363, 1)))","v":""},{"$f":"IF(D364=\"\",\"\",IF(D364<D363,IF(1+INDEX(C:C,MATCH(MAX(C$1:C363)+1,C$1:C363, 1))>12,1,1+INDEX(C:C,MATCH(MAX(C$1:C363)+1,C$1:C363, 1))),\"\"))","v":""},null,null,{"$f":"IF(E364=\"\",\"\",IF(COUNTIF(E$6:E363,E364)<1,\"初\",IFERROR(VLOOKUP(INDEX(F$1:F363,_xlfn.AGGREGATE(14,6,ROW(E$6:E363)/(E$6:E363=E364),1)),{\"申\",\"　\";\"　\",\"申\"},2,0),\"\")))","v":""},null,null,null,null,null,null,null,null," "]
[null,{"$f":"IF(C365<>1,\"\",1+INDEX(B:B,MATCH(MAX(B$1:B364)+1,B$1:B364, 1)))","v":""},{"$f":"IF(D365=\"\",\"\",IF(D365<D364,IF(1+INDEX(C:C,MATCH(MAX(C$1:C364)+1,C$1:C364, 1))>12,1,1+INDEX(C:C,MATCH(MAX(C$1:C364)+1,C$1:C364, 1))),\"\"))","v":""},null,null,{"$f":"IF(E365=\"\",\"\",IF(COUNTIF(E$6:E364,E365)<1,\"初\",IFERROR(VLOOKUP(INDEX(F$1:F364,_xlfn.AGGREGATE(14,6,ROW(E$6:E364)/(E$6:E364=E365),1)),{\"申\",\"　\";\"　\",\"申\"},2,0),\"\")))","v":""},null,null,null,null,null,null,null,null," "]
[null,{"$f":"IF(C366<>1,\"\",1+INDEX(B:B,MATCH(MAX(B$1:B365)+1,B$1:B365, 1)))","v":""},{"$f":"IF(D366=\"\",\"\",IF(D366<D365,IF(1+INDEX(C:C,MATCH(MAX(C$1:C365)+1,C$1:C365, 1))>12,1,1+INDEX(C:C,MATCH(MAX(C$1:C365)+1,C$1:C365, 1))),\"\"))","v":""},null,null,{"$f":"IF(E366=\"\",\"\",IF(COUNTIF(E$6:E365,E366)<1,\"初\",IFERROR(VLOOKUP(INDEX(F$1:F365,_xlfn.AGGREGATE(14,6,ROW(E$6:E365)/(E$6:E365=E366),1)),{\"申\",\"　\";\"　\",\"申\"},2,0),\"\")))","v":""},null,null,null,null,null,null,null,null," "]
[null,{"$f":"IF(C367<>1,\"\",1+INDEX(B:B,MATCH(MAX(B$1:B366)+1,B$1:B366, 1)))","v":""},{"$f":"IF(D367=\"\",\"\",IF(D367<D366,IF(1+INDEX(C:C,MATCH(MAX(C$1:C366)+1,C$1:C366, 1))>12,1,1+INDEX(C:C,MATCH(MAX(C$1:C366)+1,C$1:C366, 1))),\"\"))","v":""},null,null,{"$f":"IF(E367=\"\",\"\",IF(COUNTIF(E$6:E366,E367)<1,\"初\",IFERROR(VLOOKUP(INDEX(F$1:F366,_xlfn.AGGREGATE(14,6,ROW(E$6:E366)/(E$6:E366=E367),1)),{\"申\",\"　\";\"　\",\"申\"},2,0),\"\")))","v":""},null,null,null,null,null,null,null,null," "]
[null,{"$f":"IF(C368<>1,\"\",1+INDEX(B:B,MATCH(MAX(B$1:B367)+1,B$1:B367, 1)))","v":""},{"$f":"IF(D368=\"\",\"\",IF(D368<D367,IF(1+INDEX(C:C,MATCH(MAX(C$1:C367)+1,C$1:C367, 1))>12,1,1+INDEX(C:C,MATCH(MAX(C$1:C367)+1,C$1:C367, 1))),\"\"))","v":""},null,null,{"$f":"IF(E368=\"\",\"\",IF(COUNTIF(E$6:E367,E368)<1,\"初\",IFERROR(VLOOKUP(INDEX(F$1:F367,_xlfn.AGGREGATE(14,6,ROW(E$6:E367)/(E$6:E367=E368),1)),{\"申\",\"　\";\"　\",\"申\"},2,0),\"\")))","v":""},null,null,null,null,null,null,null,null," "]
[null,{"$f":"IF(C369<>1,\"\",1+INDEX(B:B,MATCH(MAX(B$1:B368)+1,B$1:B368, 1)))","v":""},{"$f":"IF(D369=\"\",\"\",IF(D369<D368,IF(1+INDEX(C:C,MATCH(MAX(C$1:C368)+1,C$1:C368, 1))>12,1,1+INDEX(C:C,MATCH(MAX(C$1:C368)+1,C$1:C368, 1))),\"\"))","v":""},null,null,{"$f":"IF(E369=\"\",\"\",IF(COUNTIF(E$6:E368,E369)<1,\"初\",IFERROR(VLOOKUP(INDEX(F$1:F368,_xlfn.AGGREGATE(14,6,ROW(E$6:E368)/(E$6:E368=E369),1)),{\"申\",\"　\";\"　\",\"申\"},2,0),\"\")))","v":""},null,null,null,null,null,null,null,null," "]
[null,{"$f":"IF(C370<>1,\"\",1+INDEX(B:B,MATCH(MAX(B$1:B369)+1,B$1:B369, 1)))","v":""},{"$f":"IF(D370=\"\",\"\",IF(D370<D369,IF(1+INDEX(C:C,MATCH(MAX(C$1:C369)+1,C$1:C369, 1))>12,1,1+INDEX(C:C,MATCH(MAX(C$1:C369)+1,C$1:C369, 1))),\"\"))","v":""},null,null,{"$f":"IF(E370=\"\",\"\",IF(COUNTIF(E$6:E369,E370)<1,\"初\",IFERROR(VLOOKUP(INDEX(F$1:F369,_xlfn.AGGREGATE(14,6,ROW(E$6:E369)/(E$6:E369=E370),1)),{\"申\",\"　\";\"　\",\"申\"},2,0),\"\")))","v":""},null,null,null,null,null,null,null,null," "]
[null,{"$f":"IF(C371<>1,\"\",1+INDEX(B:B,MATCH(MAX(B$1:B370)+1,B$1:B370, 1)))","v":""},{"$f":"IF(D371=\"\",\"\",IF(D371<D370,IF(1+INDEX(C:C,MATCH(MAX(C$1:C370)+1,C$1:C370, 1))>12,1,1+INDEX(C:C,MATCH(MAX(C$1:C370)+1,C$1:C370, 1))),\"\"))","v":""},null,null,{"$f":"IF(E371=\"\",\"\",IF(COUNTIF(E$6:E370,E371)<1,\"初\",IFERROR(VLOOKUP(INDEX(F$1:F370,_xlfn.AGGREGATE(14,6,ROW(E$6:E370)/(E$6:E370=E371),1)),{\"申\",\"　\";\"　\",\"申\"},2,0),\"\")))","v":""},null,null,null,null,null,null,null,null," "]
[null,{"$f":"IF(C372<>1,\"\",1+INDEX(B:B,MATCH(MAX(B$1:B371)+1,B$1:B371, 1)))","v":""},{"$f":"IF(D372=\"\",\"\",IF(D372<D371,IF(1+INDEX(C:C,MATCH(MAX(C$1:C371)+1,C$1:C371, 1))>12,1,1+INDEX(C:C,MATCH(MAX(C$1:C371)+1,C$1:C371, 1))),\"\"))","v":""},null,null,{"$f":"IF(E372=\"\",\"\",IF(COUNTIF(E$6:E371,E372)<1,\"初\",IFERROR(VLOOKUP(INDEX(F$1:F371,_xlfn.AGGREGATE(14,6,ROW(E$6:E371)/(E$6:E371=E372),1)),{\"申\",\"　\";\"　\",\"申\"},2,0),\"\")))","v":""},null,null,null,null,null,null,null,null," "]
[null,{"$f":"IF(C373<>1,\"\",1+INDEX(B:B,MATCH(MAX(B$1:B372)+1,B$1:B372, 1)))","v":""},{"$f":"IF(D373=\"\",\"\",IF(D373<D372,IF(1+INDEX(C:C,MATCH(MAX(C$1:C372)+1,C$1:C372, 1))>12,1,1+INDEX(C:C,MATCH(MAX(C$1:C372)+1,C$1:C372, 1))),\"\"))","v":""},null,null,{"$f":"IF(E373=\"\",\"\",IF(COUNTIF(E$6:E372,E373)<1,\"初\",IFERROR(VLOOKUP(INDEX(F$1:F372,_xlfn.AGGREGATE(14,6,ROW(E$6:E372)/(E$6:E372=E373),1)),{\"申\",\"　\";\"　\",\"申\"},2,0),\"\")))","v":""},null,null,null,null,null,null,null,null," "]
[null,{"$f":"IF(C374<>1,\"\",1+INDEX(B:B,MATCH(MAX(B$1:B373)+1,B$1:B373, 1)))","v":""},{"$f":"IF(D374=\"\",\"\",IF(D374<D373,IF(1+INDEX(C:C,MATCH(MAX(C$1:C373)+1,C$1:C373, 1))>12,1,1+INDEX(C:C,MATCH(MAX(C$1:C373)+1,C$1:C373, 1))),\"\"))","v":""},null,null,{"$f":"IF(E374=\"\",\"\",IF(COUNTIF(E$6:E373,E374)<1,\"初\",IFERROR(VLOOKUP(INDEX(F$1:F373,_xlfn.AGGREGATE(14,6,ROW(E$6:E373)/(E$6:E373=E374),1)),{\"申\",\"　\";\"　\",\"申\"},2,0),\"\")))","v":""},null,null,null,null,null,null,null,null," "]
[null,{"$f":"IF(C375<>1,\"\",1+INDEX(B:B,MATCH(MAX(B$1:B374)+1,B$1:B374, 1)))","v":""},{"$f":"IF(D375=\"\",\"\",IF(D375<D374,IF(1+INDEX(C:C,MATCH(MAX(C$1:C374)+1,C$1:C374, 1))>12,1,1+INDEX(C:C,MATCH(MAX(C$1:C374)+1,C$1:C374, 1))),\"\"))","v":""},null,null,{"$f":"IF(E375=\"\",\"\",IF(COUNTIF(E$6:E374,E375)<1,\"初\",IFERROR(VLOOKUP(INDEX(F$1:F374,_xlfn.AGGREGATE(14,6,ROW(E$6:E374)/(E$6:E374=E375),1)),{\"申\",\"　\";\"　\",\"申\"},2,0),\"\")))","v":""},null,null,null,null,null,null,null,null," "]
[null,{"$f":"IF(C376<>1,\"\",1+INDEX(B:B,MATCH(MAX(B$1:B375)+1,B$1:B375, 1)))","v":""},{"$f":"IF(D376=\"\",\"\",IF(D376<D375,IF(1+INDEX(C:C,MATCH(MAX(C$1:C375)+1,C$1:C375, 1))>12,1,1+INDEX(C:C,MATCH(MAX(C$1:C375)+1,C$1:C375, 1))),\"\"))","v":""},null,null,{"$f":"IF(E376=\"\",\"\",IF(COUNTIF(E$6:E375,E376)<1,\"初\",IFERROR(VLOOKUP(INDEX(F$1:F375,_xlfn.AGGREGATE(14,6,ROW(E$6:E375)/(E$6:E375=E376),1)),{\"申\",\"　\";\"　\",\"申\"},2,0),\"\")))","v":""},null,null,null,null,null,null,null,null," "]
[null,{"$f":"IF(C377<>1,\"\",1+INDEX(B:B,MATCH(MAX(B$1:B376)+1,B$1:B376, 1)))","v":""},{"$f":"IF(D377=\"\",\"\",IF(D377<D376,IF(1+INDEX(C:C,MATCH(MAX(C$1:C376)+1,C$1:C376, 1))>12,1,1+INDEX(C:C,MATCH(MAX(C$1:C376)+1,C$1:C376, 1))),\"\"))","v":""},null,null,{"$f":"IF(E377=\"\",\"\",IF(COUNTIF(E$6:E376,E377)<1,\"初\",IFERROR(VLOOKUP(INDEX(F$1:F376,_xlfn.AGGREGATE(14,6,ROW(E$6:E376)/(E$6:E376=E377),1)),{\"申\",\"　\";\"　\",\"申\"},2,0),\"\")))","v":""},null,null,null,null,null,null,null,null," "]
[null,{"$f":"IF(C378<>1,\"\",1+INDEX(B:B,MATCH(MAX(B$1:B377)+1,B$1:B377, 1)))","v":""},{"$f":"IF(D378=\"\",\"\",IF(D378<D377,IF(1+INDEX(C:C,MATCH(MAX(C$1:C377)+1,C$1:C377, 1))>12,1,1+INDEX(C:C,MATCH(MAX(C$1:C377)+1,C$1:C377, 1))),\"\"))","v":""},null,null,{"$f":"IF(E378=\"\",\"\",IF(COUNTIF(E$6:E377,E378)<1,\"初\",IFERROR(VLOOKUP(INDEX(F$1:F377,_xlfn.AGGREGATE(14,6,ROW(E$6:E377)/(E$6:E377=E378),1)),{\"申\",\"　\";\"　\",\"申\"},2,0),\"\")))","v":""},null,null,null,null,null,null,null,null," "]
[null,{"$f":"IF(C379<>1,\"\",1+INDEX(B:B,MATCH(MAX(B$1:B378)+1,B$1:B378, 1)))","v":""},{"$f":"IF(D379=\"\",\"\",IF(D379<D378,IF(1+INDEX(C:C,MATCH(MAX(C$1:C378)+1,C$1:C378, 1))>12,1,1+INDEX(C:C,MATCH(MAX(C$1:C378)+1,C$1:C378, 1))),\"\"))","v":""},null,null,{"$f":"IF(E379=\"\",\"\",IF(COUNTIF(E$6:E378,E379)<1,\"初\",IFERROR(VLOOKUP(INDEX(F$1:F378,_xlfn.AGGREGATE(14,6,ROW(E$6:E378)/(E$6:E378=E379),1)),{\"申\",\"　\";\"　\",\"申\"},2,0),\"\")))","v":""},null,null,null,null,null,null,null,null," "]
[null,{"$f":"IF(C380<>1,\"\",1+INDEX(B:B,MATCH(MAX(B$1:B379)+1,B$1:B379, 1)))","v":""},{"$f":"IF(D380=\"\",\"\",IF(D380<D379,IF(1+INDEX(C:C,MATCH(MAX(C$1:C379)+1,C$1:C379, 1))>12,1,1+INDEX(C:C,MATCH(MAX(C$1:C379)+1,C$1:C379, 1))),\"\"))","v":""},null,null,{"$f":"IF(E380=\"\",\"\",IF(COUNTIF(E$6:E379,E380)<1,\"初\",IFERROR(VLOOKUP(INDEX(F$1:F379,_xlfn.AGGREGATE(14,6,ROW(E$6:E379)/(E$6:E379=E380),1)),{\"申\",\"　\";\"　\",\"申\"},2,0),\"\")))","v":""},null,null,null,null,null,null,null,null," "]
[null,{"$f":"IF(C381<>1,\"\",1+INDEX(B:B,MATCH(MAX(B$1:B380)+1,B$1:B380, 1)))","v":""},{"$f":"IF(D381=\"\",\"\",IF(D381<D380,IF(1+INDEX(C:C,MATCH(MAX(C$1:C380)+1,C$1:C380, 1))>12,1,1+INDEX(C:C,MATCH(MAX(C$1:C380)+1,C$1:C380, 1))),\"\"))","v":""},null,null,{"$f":"IF(E381=\"\",\"\",IF(COUNTIF(E$6:E380,E381)<1,\"初\",IFERROR(VLOOKUP(INDEX(F$1:F380,_xlfn.AGGREGATE(14,6,ROW(E$6:E380)/(E$6:E380=E381),1)),{\"申\",\"　\";\"　\",\"申\"},2,0),\"\")))","v":""},null,null,null,null,null,null,null,null," "]
[null,{"$f":"IF(C382<>1,\"\",1+INDEX(B:B,MATCH(MAX(B$1:B381)+1,B$1:B381, 1)))","v":""},{"$f":"IF(D382=\"\",\"\",IF(D382<D381,IF(1+INDEX(C:C,MATCH(MAX(C$1:C381)+1,C$1:C381, 1))>12,1,1+INDEX(C:C,MATCH(MAX(C$1:C381)+1,C$1:C381, 1))),\"\"))","v":""},null,null,{"$f":"IF(E382=\"\",\"\",IF(COUNTIF(E$6:E381,E382)<1,\"初\",IFERROR(VLOOKUP(INDEX(F$1:F381,_xlfn.AGGREGATE(14,6,ROW(E$6:E381)/(E$6:E381=E382),1)),{\"申\",\"　\";\"　\",\"申\"},2,0),\"\")))","v":""},null,null,null,null,null,null,null,null," "]
[null,{"$f":"IF(C383<>1,\"\",1+INDEX(B:B,MATCH(MAX(B$1:B382)+1,B$1:B382, 1)))","v":""},{"$f":"IF(D383=\"\",\"\",IF(D383<D382,IF(1+INDEX(C:C,MATCH(MAX(C$1:C382)+1,C$1:C382, 1))>12,1,1+INDEX(C:C,MATCH(MAX(C$1:C382)+1,C$1:C382, 1))),\"\"))","v":""},null,null,{"$f":"IF(E383=\"\",\"\",IF(COUNTIF(E$6:E382,E383)<1,\"初\",IFERROR(VLOOKUP(INDEX(F$1:F382,_xlfn.AGGREGATE(14,6,ROW(E$6:E382)/(E$6:E382=E383),1)),{\"申\",\"　\";\"　\",\"申\"},2,0),\"\")))","v":""},null,null,null,null,null,null,null,null," "]
[null,{"$f":"IF(C384<>1,\"\",1+INDEX(B:B,MATCH(MAX(B$1:B383)+1,B$1:B383, 1)))","v":""},{"$f":"IF(D384=\"\",\"\",IF(D384<D383,IF(1+INDEX(C:C,MATCH(MAX(C$1:C383)+1,C$1:C383, 1))>12,1,1+INDEX(C:C,MATCH(MAX(C$1:C383)+1,C$1:C383, 1))),\"\"))","v":""},null,null,{"$f":"IF(E384=\"\",\"\",IF(COUNTIF(E$6:E383,E384)<1,\"初\",IFERROR(VLOOKUP(INDEX(F$1:F383,_xlfn.AGGREGATE(14,6,ROW(E$6:E383)/(E$6:E383=E384),1)),{\"申\",\"　\";\"　\",\"申\"},2,0),\"\")))","v":""},null,null,null,null,null,null,null,null," "]
[null,{"$f":"IF(C385<>1,\"\",1+INDEX(B:B,MATCH(MAX(B$1:B384)+1,B$1:B384, 1)))","v":""},{"$f":"IF(D385=\"\",\"\",IF(D385<D384,IF(1+INDEX(C:C,MATCH(MAX(C$1:C384)+1,C$1:C384, 1))>12,1,1+INDEX(C:C,MATCH(MAX(C$1:C384)+1,C$1:C384, 1))),\"\"))","v":""},null,null,{"$f":"IF(E385=\"\",\"\",IF(COUNTIF(E$6:E384,E385)<1,\"初\",IFERROR(VLOOKUP(INDEX(F$1:F384,_xlfn.AGGREGATE(14,6,ROW(E$6:E384)/(E$6:E384=E385),1)),{\"申\",\"　\";\"　\",\"申\"},2,0),\"\")))","v":""},null,null,null,null,null,null,null,null," "]
[null,{"$f":"IF(C386<>1,\"\",1+INDEX(B:B,MATCH(MAX(B$1:B385)+1,B$1:B385, 1)))","v":""},{"$f":"IF(D386=\"\",\"\",IF(D386<D385,IF(1+INDEX(C:C,MATCH(MAX(C$1:C385)+1,C$1:C385, 1))>12,1,1+INDEX(C:C,MATCH(MAX(C$1:C385)+1,C$1:C385, 1))),\"\"))","v":""},null,null,{"$f":"IF(E386=\"\",\"\",IF(COUNTIF(E$6:E385,E386)<1,\"初\",IFERROR(VLOOKUP(INDEX(F$1:F385,_xlfn.AGGREGATE(14,6,ROW(E$6:E385)/(E$6:E385=E386),1)),{\"申\",\"　\";\"　\",\"申\"},2,0),\"\")))","v":""},null,null,null,null,null,null,null,null," "]
[null,{"$f":"IF(C387<>1,\"\",1+INDEX(B:B,MATCH(MAX(B$1:B386)+1,B$1:B386, 1)))","v":""},{"$f":"IF(D387=\"\",\"\",IF(D387<D386,IF(1+INDEX(C:C,MATCH(MAX(C$1:C386)+1,C$1:C386, 1))>12,1,1+INDEX(C:C,MATCH(MAX(C$1:C386)+1,C$1:C386, 1))),\"\"))","v":""},null,null,{"$f":"IF(E387=\"\",\"\",IF(COUNTIF(E$6:E386,E387)<1,\"初\",IFERROR(VLOOKUP(INDEX(F$1:F386,_xlfn.AGGREGATE(14,6,ROW(E$6:E386)/(E$6:E386=E387),1)),{\"申\",\"　\";\"　\",\"申\"},2,0),\"\")))","v":""},null,null,null,null,null,null,null,null," "]
[null,{"$f":"IF(C388<>1,\"\",1+INDEX(B:B,MATCH(MAX(B$1:B387)+1,B$1:B387, 1)))","v":""},{"$f":"IF(D388=\"\",\"\",IF(D388<D387,IF(1+INDEX(C:C,MATCH(MAX(C$1:C387)+1,C$1:C387, 1))>12,1,1+INDEX(C:C,MATCH(MAX(C$1:C387)+1,C$1:C387, 1))),\"\"))","v":""},null,null,{"$f":"IF(E388=\"\",\"\",IF(COUNTIF(E$6:E387,E388)<1,\"初\",IFERROR(VLOOKUP(INDEX(F$1:F387,_xlfn.AGGREGATE(14,6,ROW(E$6:E387)/(E$6:E387=E388),1)),{\"申\",\"　\";\"　\",\"申\"},2,0),\"\")))","v":""},null,null,null,null,null,null,null,null," "]
[null,{"$f":"IF(C389<>1,\"\",1+INDEX(B:B,MATCH(MAX(B$1:B388)+1,B$1:B388, 1)))","v":""},{"$f":"IF(D389=\"\",\"\",IF(D389<D388,IF(1+INDEX(C:C,MATCH(MAX(C$1:C388)+1,C$1:C388, 1))>12,1,1+INDEX(C:C,MATCH(MAX(C$1:C388)+1,C$1:C388, 1))),\"\"))","v":""},null,null,{"$f":"IF(E389=\"\",\"\",IF(COUNTIF(E$6:E388,E389)<1,\"初\",IFERROR(VLOOKUP(INDEX(F$1:F388,_xlfn.AGGREGATE(14,6,ROW(E$6:E388)/(E$6:E388=E389),1)),{\"申\",\"　\";\"　\",\"申\"},2,0),\"\")))","v":""},null,null,null,null,null,null,null,null," "]
[null,{"$f":"IF(C390<>1,\"\",1+INDEX(B:B,MATCH(MAX(B$1:B389)+1,B$1:B389, 1)))","v":""},{"$f":"IF(D390=\"\",\"\",IF(D390<D389,IF(1+INDEX(C:C,MATCH(MAX(C$1:C389)+1,C$1:C389, 1))>12,1,1+INDEX(C:C,MATCH(MAX(C$1:C389)+1,C$1:C389, 1))),\"\"))","v":""},null,null,{"$f":"IF(E390=\"\",\"\",IF(COUNTIF(E$6:E389,E390)<1,\"初\",IFERROR(VLOOKUP(INDEX(F$1:F389,_xlfn.AGGREGATE(14,6,ROW(E$6:E389)/(E$6:E389=E390),1)),{\"申\",\"　\";\"　\",\"申\"},2,0),\"\")))","v":""},null,null,null,null,null,null,null,null," "]
[null,{"$f":"IF(C391<>1,\"\",1+INDEX(B:B,MATCH(MAX(B$1:B390)+1,B$1:B390, 1)))","v":""},{"$f":"IF(D391=\"\",\"\",IF(D391<D390,IF(1+INDEX(C:C,MATCH(MAX(C$1:C390)+1,C$1:C390, 1))>12,1,1+INDEX(C:C,MATCH(MAX(C$1:C390)+1,C$1:C390, 1))),\"\"))","v":""},null,null,{"$f":"IF(E391=\"\",\"\",IF(COUNTIF(E$6:E390,E391)<1,\"初\",IFERROR(VLOOKUP(INDEX(F$1:F390,_xlfn.AGGREGATE(14,6,ROW(E$6:E390)/(E$6:E390=E391),1)),{\"申\",\"　\";\"　\",\"申\"},2,0),\"\")))","v":""},null,null,null,null,null,null,null,null," "]
[null,{"$f":"IF(C392<>1,\"\",1+INDEX(B:B,MATCH(MAX(B$1:B391)+1,B$1:B391, 1)))","v":""},{"$f":"IF(D392=\"\",\"\",IF(D392<D391,IF(1+INDEX(C:C,MATCH(MAX(C$1:C391)+1,C$1:C391, 1))>12,1,1+INDEX(C:C,MATCH(MAX(C$1:C391)+1,C$1:C391, 1))),\"\"))","v":""},null,null,{"$f":"IF(E392=\"\",\"\",IF(COUNTIF(E$6:E391,E392)<1,\"初\",IFERROR(VLOOKUP(INDEX(F$1:F391,_xlfn.AGGREGATE(14,6,ROW(E$6:E391)/(E$6:E391=E392),1)),{\"申\",\"　\";\"　\",\"申\"},2,0),\"\")))","v":""},null,null,null,null,null,null,null,null," "]
[null,{"$f":"IF(C393<>1,\"\",1+INDEX(B:B,MATCH(MAX(B$1:B392)+1,B$1:B392, 1)))","v":""},{"$f":"IF(D393=\"\",\"\",IF(D393<D392,IF(1+INDEX(C:C,MATCH(MAX(C$1:C392)+1,C$1:C392, 1))>12,1,1+INDEX(C:C,MATCH(MAX(C$1:C392)+1,C$1:C392, 1))),\"\"))","v":""},null,null,{"$f":"IF(E393=\"\",\"\",IF(COUNTIF(E$6:E392,E393)<1,\"初\",IFERROR(VLOOKUP(INDEX(F$1:F392,_xlfn.AGGREGATE(14,6,ROW(E$6:E392)/(E$6:E392=E393),1)),{\"申\",\"　\";\"　\",\"申\"},2,0),\"\")))","v":""},null,null,null,null,null,null,null,null," "]
[null,{"$f":"IF(C394<>1,\"\",1+INDEX(B:B,MATCH(MAX(B$1:B393)+1,B$1:B393, 1)))","v":""},{"$f":"IF(D394=\"\",\"\",IF(D394<D393,IF(1+INDEX(C:C,MATCH(MAX(C$1:C393)+1,C$1:C393, 1))>12,1,1+INDEX(C:C,MATCH(MAX(C$1:C393)+1,C$1:C393, 1))),\"\"))","v":""},null,null,{"$f":"IF(E394=\"\",\"\",IF(COUNTIF(E$6:E393,E394)<1,\"初\",IFERROR(VLOOKUP(INDEX(F$1:F393,_xlfn.AGGREGATE(14,6,ROW(E$6:E393)/(E$6:E393=E394),1)),{\"申\",\"　\";\"　\",\"申\"},2,0),\"\")))","v":""},null,null,null,null,null,null,null,null," "]
[null,{"$f":"IF(C395<>1,\"\",1+INDEX(B:B,MATCH(MAX(B$1:B394)+1,B$1:B394, 1)))","v":""},{"$f":"IF(D395=\"\",\"\",IF(D395<D394,IF(1+INDEX(C:C,MATCH(MAX(C$1:C394)+1,C$1:C394, 1))>12,1,1+INDEX(C:C,MATCH(MAX(C$1:C394)+1,C$1:C394, 1))),\"\"))","v":""},null,null,{"$f":"IF(E395=\"\",\"\",IF(COUNTIF(E$6:E394,E395)<1,\"初\",IFERROR(VLOOKUP(INDEX(F$1:F394,_xlfn.AGGREGATE(14,6,ROW(E$6:E394)/(E$6:E394=E395),1)),{\"申\",\"　\";\"　\",\"申\"},2,0),\"\")))","v":""},null,null,null,null,null,null,null,null," "]
[null,{"$f":"IF(C396<>1,\"\",1+INDEX(B:B,MATCH(MAX(B$1:B395)+1,B$1:B395, 1)))","v":""},{"$f":"IF(D396=\"\",\"\",IF(D396<D395,IF(1+INDEX(C:C,MATCH(MAX(C$1:C395)+1,C$1:C395, 1))>12,1,1+INDEX(C:C,MATCH(MAX(C$1:C395)+1,C$1:C395, 1))),\"\"))","v":""},null,null,{"$f":"IF(E396=\"\",\"\",IF(COUNTIF(E$6:E395,E396)<1,\"初\",IFERROR(VLOOKUP(INDEX(F$1:F395,_xlfn.AGGREGATE(14,6,ROW(E$6:E395)/(E$6:E395=E396),1)),{\"申\",\"　\";\"　\",\"申\"},2,0),\"\")))","v":""},null,null,null,null,null,null,null,null," "]
[null,{"$f":"IF(C397<>1,\"\",1+INDEX(B:B,MATCH(MAX(B$1:B396)+1,B$1:B396, 1)))","v":""},{"$f":"IF(D397=\"\",\"\",IF(D397<D396,IF(1+INDEX(C:C,MATCH(MAX(C$1:C396)+1,C$1:C396, 1))>12,1,1+INDEX(C:C,MATCH(MAX(C$1:C396)+1,C$1:C396, 1))),\"\"))","v":""},null,null,{"$f":"IF(E397=\"\",\"\",IF(COUNTIF(E$6:E396,E397)<1,\"初\",IFERROR(VLOOKUP(INDEX(F$1:F396,_xlfn.AGGREGATE(14,6,ROW(E$6:E396)/(E$6:E396=E397),1)),{\"申\",\"　\";\"　\",\"申\"},2,0),\"\")))","v":""},null,null,null,null,null,null,null,null," "]
[null,{"$f":"IF(C398<>1,\"\",1+INDEX(B:B,MATCH(MAX(B$1:B397)+1,B$1:B397, 1)))","v":""},{"$f":"IF(D398=\"\",\"\",IF(D398<D397,IF(1+INDEX(C:C,MATCH(MAX(C$1:C397)+1,C$1:C397, 1))>12,1,1+INDEX(C:C,MATCH(MAX(C$1:C397)+1,C$1:C397, 1))),\"\"))","v":""},null,null,{"$f":"IF(E398=\"\",\"\",IF(COUNTIF(E$6:E397,E398)<1,\"初\",IFERROR(VLOOKUP(INDEX(F$1:F397,_xlfn.AGGREGATE(14,6,ROW(E$6:E397)/(E$6:E397=E398),1)),{\"申\",\"　\";\"　\",\"申\"},2,0),\"\")))","v":""},null,null,null,null,null,null,null,null," "]
[null,{"$f":"IF(C399<>1,\"\",1+INDEX(B:B,MATCH(MAX(B$1:B398)+1,B$1:B398, 1)))","v":""},{"$f":"IF(D399=\"\",\"\",IF(D399<D398,IF(1+INDEX(C:C,MATCH(MAX(C$1:C398)+1,C$1:C398, 1))>12,1,1+INDEX(C:C,MATCH(MAX(C$1:C398)+1,C$1:C398, 1))),\"\"))","v":""},null,null,{"$f":"IF(E399=\"\",\"\",IF(COUNTIF(E$6:E398,E399)<1,\"初\",IFERROR(VLOOKUP(INDEX(F$1:F398,_xlfn.AGGREGATE(14,6,ROW(E$6:E398)/(E$6:E398=E399),1)),{\"申\",\"　\";\"　\",\"申\"},2,0),\"\")))","v":""},null,null,null,null,null,null,null,null," "]
[null,{"$f":"IF(C400<>1,\"\",1+INDEX(B:B,MATCH(MAX(B$1:B399)+1,B$1:B399, 1)))","v":""},{"$f":"IF(D400=\"\",\"\",IF(D400<D399,IF(1+INDEX(C:C,MATCH(MAX(C$1:C399)+1,C$1:C399, 1))>12,1,1+INDEX(C:C,MATCH(MAX(C$1:C399)+1,C$1:C399, 1))),\"\"))","v":""},null,null,{"$f":"IF(E400=\"\",\"\",IF(COUNTIF(E$6:E399,E400)<1,\"初\",IFERROR(VLOOKUP(INDEX(F$1:F399,_xlfn.AGGREGATE(14,6,ROW(E$6:E399)/(E$6:E399=E400),1)),{\"申\",\"　\";\"　\",\"申\"},2,0),\"\")))","v":""},null,null,null,null,null,null,null,null," "]
[null,{"$f":"IF(C401<>1,\"\",1+INDEX(B:B,MATCH(MAX(B$1:B400)+1,B$1:B400, 1)))","v":""},{"$f":"IF(D401=\"\",\"\",IF(D401<D400,IF(1+INDEX(C:C,MATCH(MAX(C$1:C400)+1,C$1:C400, 1))>12,1,1+INDEX(C:C,MATCH(MAX(C$1:C400)+1,C$1:C400, 1))),\"\"))","v":""},null,null,{"$f":"IF(E401=\"\",\"\",IF(COUNTIF(E$6:E400,E401)<1,\"初\",IFERROR(VLOOKUP(INDEX(F$1:F400,_xlfn.AGGREGATE(14,6,ROW(E$6:E400)/(E$6:E400=E401),1)),{\"申\",\"　\";\"　\",\"申\"},2,0),\"\")))","v":""},null,null,null,null,null,null,null,null," "]
[null,{"$f":"IF(C402<>1,\"\",1+INDEX(B:B,MATCH(MAX(B$1:B401)+1,B$1:B401, 1)))","v":""},{"$f":"IF(D402=\"\",\"\",IF(D402<D401,IF(1+INDEX(C:C,MATCH(MAX(C$1:C401)+1,C$1:C401, 1))>12,1,1+INDEX(C:C,MATCH(MAX(C$1:C401)+1,C$1:C401, 1))),\"\"))","v":""},null,null,{"$f":"IF(E402=\"\",\"\",IF(COUNTIF(E$6:E401,E402)<1,\"初\",IFERROR(VLOOKUP(INDEX(F$1:F401,_xlfn.AGGREGATE(14,6,ROW(E$6:E401)/(E$6:E401=E402),1)),{\"申\",\"　\";\"　\",\"申\"},2,0),\"\")))","v":""},null,null,null,null,null,null,null,null," "]
[null,{"$f":"IF(C403<>1,\"\",1+INDEX(B:B,MATCH(MAX(B$1:B402)+1,B$1:B402, 1)))","v":""},{"$f":"IF(D403=\"\",\"\",IF(D403<D402,IF(1+INDEX(C:C,MATCH(MAX(C$1:C402)+1,C$1:C402, 1))>12,1,1+INDEX(C:C,MATCH(MAX(C$1:C402)+1,C$1:C402, 1))),\"\"))","v":""},null,null,{"$f":"IF(E403=\"\",\"\",IF(COUNTIF(E$6:E402,E403)<1,\"初\",IFERROR(VLOOKUP(INDEX(F$1:F402,_xlfn.AGGREGATE(14,6,ROW(E$6:E402)/(E$6:E402=E403),1)),{\"申\",\"　\";\"　\",\"申\"},2,0),\"\")))","v":""},null,null,null,null,null,null,null,null," "]
[null,{"$f":"IF(C404<>1,\"\",1+INDEX(B:B,MATCH(MAX(B$1:B403)+1,B$1:B403, 1)))","v":""},{"$f":"IF(D404=\"\",\"\",IF(D404<D403,IF(1+INDEX(C:C,MATCH(MAX(C$1:C403)+1,C$1:C403, 1))>12,1,1+INDEX(C:C,MATCH(MAX(C$1:C403)+1,C$1:C403, 1))),\"\"))","v":""},null,null,{"$f":"IF(E404=\"\",\"\",IF(COUNTIF(E$6:E403,E404)<1,\"初\",IFERROR(VLOOKUP(INDEX(F$1:F403,_xlfn.AGGREGATE(14,6,ROW(E$6:E403)/(E$6:E403=E404),1)),{\"申\",\"　\";\"　\",\"申\"},2,0),\"\")))","v":""},null,null,null,null,null,null,null,null," "]
[null,{"$f":"IF(C405<>1,\"\",1+INDEX(B:B,MATCH(MAX(B$1:B404)+1,B$1:B404, 1)))","v":""},{"$f":"IF(D405=\"\",\"\",IF(D405<D404,IF(1+INDEX(C:C,MATCH(MAX(C$1:C404)+1,C$1:C404, 1))>12,1,1+INDEX(C:C,MATCH(MAX(C$1:C404)+1,C$1:C404, 1))),\"\"))","v":""},null,null,{"$f":"IF(E405=\"\",\"\",IF(COUNTIF(E$6:E404,E405)<1,\"初\",IFERROR(VLOOKUP(INDEX(F$1:F404,_xlfn.AGGREGATE(14,6,ROW(E$6:E404)/(E$6:E404=E405),1)),{\"申\",\"　\";\"　\",\"申\"},2,0),\"\")))","v":""},null,null,null,null,null,null,null,null," "]
[null,{"$f":"IF(C406<>1,\"\",1+INDEX(B:B,MATCH(MAX(B$1:B405)+1,B$1:B405, 1)))","v":""},{"$f":"IF(D406=\"\",\"\",IF(D406<D405,IF(1+INDEX(C:C,MATCH(MAX(C$1:C405)+1,C$1:C405, 1))>12,1,1+INDEX(C:C,MATCH(MAX(C$1:C405)+1,C$1:C405, 1))),\"\"))","v":""},null,null,{"$f":"IF(E406=\"\",\"\",IF(COUNTIF(E$6:E405,E406)<1,\"初\",IFERROR(VLOOKUP(INDEX(F$1:F405,_xlfn.AGGREGATE(14,6,ROW(E$6:E405)/(E$6:E405=E406),1)),{\"申\",\"　\";\"　\",\"申\"},2,0),\"\")))","v":""},null,null,null,null,null,null,null,null," "]
[null,{"$f":"IF(C407<>1,\"\",1+INDEX(B:B,MATCH(MAX(B$1:B406)+1,B$1:B406, 1)))","v":""},{"$f":"IF(D407=\"\",\"\",IF(D407<D406,IF(1+INDEX(C:C,MATCH(MAX(C$1:C406)+1,C$1:C406, 1))>12,1,1+INDEX(C:C,MATCH(MAX(C$1:C406)+1,C$1:C406, 1))),\"\"))","v":""},null,null,{"$f":"IF(E407=\"\",\"\",IF(COUNTIF(E$6:E406,E407)<1,\"初\",IFERROR(VLOOKUP(INDEX(F$1:F406,_xlfn.AGGREGATE(14,6,ROW(E$6:E406)/(E$6:E406=E407),1)),{\"申\",\"　\";\"　\",\"申\"},2,0),\"\")))","v":""},null,null,null,null,null,null,null,null," "]
[null,{"$f":"IF(C408<>1,\"\",1+INDEX(B:B,MATCH(MAX(B$1:B407)+1,B$1:B407, 1)))","v":""},{"$f":"IF(D408=\"\",\"\",IF(D408<D407,IF(1+INDEX(C:C,MATCH(MAX(C$1:C407)+1,C$1:C407, 1))>12,1,1+INDEX(C:C,MATCH(MAX(C$1:C407)+1,C$1:C407, 1))),\"\"))","v":""},null,null,{"$f":"IF(E408=\"\",\"\",IF(COUNTIF(E$6:E407,E408)<1,\"初\",IFERROR(VLOOKUP(INDEX(F$1:F407,_xlfn.AGGREGATE(14,6,ROW(E$6:E407)/(E$6:E407=E408),1)),{\"申\",\"　\";\"　\",\"申\"},2,0),\"\")))","v":""},null,null,null,null,null,null,null,null," "]
[null,{"$f":"IF(C409<>1,\"\",1+INDEX(B:B,MATCH(MAX(B$1:B408)+1,B$1:B408, 1)))","v":""},{"$f":"IF(D409=\"\",\"\",IF(D409<D408,IF(1+INDEX(C:C,MATCH(MAX(C$1:C408)+1,C$1:C408, 1))>12,1,1+INDEX(C:C,MATCH(MAX(C$1:C408)+1,C$1:C408, 1))),\"\"))","v":""},null,null,{"$f":"IF(E409=\"\",\"\",IF(COUNTIF(E$6:E408,E409)<1,\"初\",IFERROR(VLOOKUP(INDEX(F$1:F408,_xlfn.AGGREGATE(14,6,ROW(E$6:E408)/(E$6:E408=E409),1)),{\"申\",\"　\";\"　\",\"申\"},2,0),\"\")))","v":""},null,null,null,null,null,null,null,null," "]
[null,{"$f":"IF(C410<>1,\"\",1+INDEX(B:B,MATCH(MAX(B$1:B409)+1,B$1:B409, 1)))","v":""},{"$f":"IF(D410=\"\",\"\",IF(D410<D409,IF(1+INDEX(C:C,MATCH(MAX(C$1:C409)+1,C$1:C409, 1))>12,1,1+INDEX(C:C,MATCH(MAX(C$1:C409)+1,C$1:C409, 1))),\"\"))","v":""},null,null,{"$f":"IF(E410=\"\",\"\",IF(COUNTIF(E$6:E409,E410)<1,\"初\",IFERROR(VLOOKUP(INDEX(F$1:F409,_xlfn.AGGREGATE(14,6,ROW(E$6:E409)/(E$6:E409=E410),1)),{\"申\",\"　\";\"　\",\"申\"},2,0),\"\")))","v":""},null,null,null,null,null,null,null,null," "]
[null,{"$f":"IF(C411<>1,\"\",1+INDEX(B:B,MATCH(MAX(B$1:B410)+1,B$1:B410, 1)))","v":""},{"$f":"IF(D411=\"\",\"\",IF(D411<D410,IF(1+INDEX(C:C,MATCH(MAX(C$1:C410)+1,C$1:C410, 1))>12,1,1+INDEX(C:C,MATCH(MAX(C$1:C410)+1,C$1:C410, 1))),\"\"))","v":""},null,null,{"$f":"IF(E411=\"\",\"\",IF(COUNTIF(E$6:E410,E411)<1,\"初\",IFERROR(VLOOKUP(INDEX(F$1:F410,_xlfn.AGGREGATE(14,6,ROW(E$6:E410)/(E$6:E410=E411),1)),{\"申\",\"　\";\"　\",\"申\"},2,0),\"\")))","v":""},null,null,null,null,null,null,null,null," "]
[null,{"$f":"IF(C412<>1,\"\",1+INDEX(B:B,MATCH(MAX(B$1:B411)+1,B$1:B411, 1)))","v":""},{"$f":"IF(D412=\"\",\"\",IF(D412<D411,IF(1+INDEX(C:C,MATCH(MAX(C$1:C411)+1,C$1:C411, 1))>12,1,1+INDEX(C:C,MATCH(MAX(C$1:C411)+1,C$1:C411, 1))),\"\"))","v":""},null,null,{"$f":"IF(E412=\"\",\"\",IF(COUNTIF(E$6:E411,E412)<1,\"初\",IFERROR(VLOOKUP(INDEX(F$1:F411,_xlfn.AGGREGATE(14,6,ROW(E$6:E411)/(E$6:E411=E412),1)),{\"申\",\"　\";\"　\",\"申\"},2,0),\"\")))","v":""},null,null,null,null,null,null,null,null," "]
[null,{"$f":"IF(C413<>1,\"\",1+INDEX(B:B,MATCH(MAX(B$1:B412)+1,B$1:B412, 1)))","v":""},{"$f":"IF(D413=\"\",\"\",IF(D413<D412,IF(1+INDEX(C:C,MATCH(MAX(C$1:C412)+1,C$1:C412, 1))>12,1,1+INDEX(C:C,MATCH(MAX(C$1:C412)+1,C$1:C412, 1))),\"\"))","v":""},null,null,{"$f":"IF(E413=\"\",\"\",IF(COUNTIF(E$6:E412,E413)<1,\"初\",IFERROR(VLOOKUP(INDEX(F$1:F412,_xlfn.AGGREGATE(14,6,ROW(E$6:E412)/(E$6:E412=E413),1)),{\"申\",\"　\";\"　\",\"申\"},2,0),\"\")))","v":""},null,null,null,null,null,null,null,null," "]
[null,{"$f":"IF(C414<>1,\"\",1+INDEX(B:B,MATCH(MAX(B$1:B413)+1,B$1:B413, 1)))","v":""},{"$f":"IF(D414=\"\",\"\",IF(D414<D413,IF(1+INDEX(C:C,MATCH(MAX(C$1:C413)+1,C$1:C413, 1))>12,1,1+INDEX(C:C,MATCH(MAX(C$1:C413)+1,C$1:C413, 1))),\"\"))","v":""},null,null,{"$f":"IF(E414=\"\",\"\",IF(COUNTIF(E$6:E413,E414)<1,\"初\",IFERROR(VLOOKUP(INDEX(F$1:F413,_xlfn.AGGREGATE(14,6,ROW(E$6:E413)/(E$6:E413=E414),1)),{\"申\",\"　\";\"　\",\"申\"},2,0),\"\")))","v":""},null,null,null,null,null,null,null,null," "]
[null,{"$f":"IF(C415<>1,\"\",1+INDEX(B:B,MATCH(MAX(B$1:B414)+1,B$1:B414, 1)))","v":""},{"$f":"IF(D415=\"\",\"\",IF(D415<D414,IF(1+INDEX(C:C,MATCH(MAX(C$1:C414)+1,C$1:C414, 1))>12,1,1+INDEX(C:C,MATCH(MAX(C$1:C414)+1,C$1:C414, 1))),\"\"))","v":""},null,null,{"$f":"IF(E415=\"\",\"\",IF(COUNTIF(E$6:E414,E415)<1,\"初\",IFERROR(VLOOKUP(INDEX(F$1:F414,_xlfn.AGGREGATE(14,6,ROW(E$6:E414)/(E$6:E414=E415),1)),{\"申\",\"　\";\"　\",\"申\"},2,0),\"\")))","v":""},null,null,null,null,null,null,null,null,{"$f":"IF(ISERROR(LEFT(E415,FIND(\"　\",E415,1)-1)&\" \"&LEFT(G415,FIND(\"　\",G415,1)-1)&\" \"&K415&L415&\" \"&H415&IF(I415<>\"\",\"or\"&I415,\"\")&J415&M415&N415), \"\", LEFT(E415,FIND(\"　\",E415,1)-1)&\" \"&LEFT(G415,FIND(\"　\",G415,1)-1)&\" \"&K415&L415&\" \"&H415&IF(I415<>\"\",\"or\"&I415,\"\")&J415&M415&N415)&\" \"&F415","v":" "}]
[null,{"$f":"IF(C416<>1,\"\",1+INDEX(B:B,MATCH(MAX(B$1:B415)+1,B$1:B415, 1)))","v":""},{"$f":"IF(D416=\"\",\"\",IF(D416<D415,IF(1+INDEX(C:C,MATCH(MAX(C$1:C415)+1,C$1:C415, 1))>12,1,1+INDEX(C:C,MATCH(MAX(C$1:C415)+1,C$1:C415, 1))),\"\"))","v":""},null,null,{"$f":"IF(E416=\"\",\"\",IF(COUNTIF(E$6:E415,E416)<1,\"初\",IFERROR(VLOOKUP(INDEX(F$1:F415,_xlfn.AGGREGATE(14,6,ROW(E$6:E415)/(E$6:E415=E416),1)),{\"申\",\"　\";\"　\",\"申\"},2,0),\"\")))","v":""},null,null,null,null,null,null,null,null," "]
[null,{"$f":"IF(C417<>1,\"\",1+INDEX(B:B,MATCH(MAX(B$1:B416)+1,B$1:B416, 1)))","v":""},{"$f":"IF(D417=\"\",\"\",IF(D417<D416,IF(1+INDEX(C:C,MATCH(MAX(C$1:C416)+1,C$1:C416, 1))>12,1,1+INDEX(C:C,MATCH(MAX(C$1:C416)+1,C$1:C416, 1))),\"\"))","v":""},null,null,{"$f":"IF(E417=\"\",\"\",IF(COUNTIF(E$6:E416,E417)<1,\"初\",IFERROR(VLOOKUP(INDEX(F$1:F416,_xlfn.AGGREGATE(14,6,ROW(E$6:E416)/(E$6:E416=E417),1)),{\"申\",\"　\";\"　\",\"申\"},2,0),\"\")))","v":""},null,null,null,null,null,null,null,null," "]
[null,{"$f":"IF(C418<>1,\"\",1+INDEX(B:B,MATCH(MAX(B$1:B417)+1,B$1:B417, 1)))","v":""},{"$f":"IF(D418=\"\",\"\",IF(D418<D417,IF(1+INDEX(C:C,MATCH(MAX(C$1:C417)+1,C$1:C417, 1))>12,1,1+INDEX(C:C,MATCH(MAX(C$1:C417)+1,C$1:C417, 1))),\"\"))","v":""},null,null,{"$f":"IF(E418=\"\",\"\",IF(COUNTIF(E$6:E417,E418)<1,\"初\",IFERROR(VLOOKUP(INDEX(F$1:F417,_xlfn.AGGREGATE(14,6,ROW(E$6:E417)/(E$6:E417=E418),1)),{\"申\",\"　\";\"　\",\"申\"},2,0),\"\")))","v":""},null,null,null,null,null,null,null,null," "]
[null,{"$f":"IF(C419<>1,\"\",1+INDEX(B:B,MATCH(MAX(B$1:B418)+1,B$1:B418, 1)))","v":""},{"$f":"IF(D419=\"\",\"\",IF(D419<D418,IF(1+INDEX(C:C,MATCH(MAX(C$1:C418)+1,C$1:C418, 1))>12,1,1+INDEX(C:C,MATCH(MAX(C$1:C418)+1,C$1:C418, 1))),\"\"))","v":""},null,null,{"$f":"IF(E419=\"\",\"\",IF(COUNTIF(E$6:E418,E419)<1,\"初\",IFERROR(VLOOKUP(INDEX(F$1:F418,_xlfn.AGGREGATE(14,6,ROW(E$6:E418)/(E$6:E418=E419),1)),{\"申\",\"　\";\"　\",\"申\"},2,0),\"\")))","v":""},null,null,null,null,null,null,null,null," "]
[null,{"$f":"IF(C420<>1,\"\",1+INDEX(B:B,MATCH(MAX(B$1:B419)+1,B$1:B419, 1)))","v":""},{"$f":"IF(D420=\"\",\"\",IF(D420<D419,IF(1+INDEX(C:C,MATCH(MAX(C$1:C419)+1,C$1:C419, 1))>12,1,1+INDEX(C:C,MATCH(MAX(C$1:C419)+1,C$1:C419, 1))),\"\"))","v":""},null,null,{"$f":"IF(E420=\"\",\"\",IF(COUNTIF(E$6:E419,E420)<1,\"初\",IFERROR(VLOOKUP(INDEX(F$1:F419,_xlfn.AGGREGATE(14,6,ROW(E$6:E419)/(E$6:E419=E420),1)),{\"申\",\"　\";\"　\",\"申\"},2,0),\"\")))","v":""},null,null,null,null,null,null,null,null," "]
[null,{"$f":"IF(C421<>1,\"\",1+INDEX(B:B,MATCH(MAX(B$1:B420)+1,B$1:B420, 1)))","v":""},{"$f":"IF(D421=\"\",\"\",IF(D421<D420,IF(1+INDEX(C:C,MATCH(MAX(C$1:C420)+1,C$1:C420, 1))>12,1,1+INDEX(C:C,MATCH(MAX(C$1:C420)+1,C$1:C420, 1))),\"\"))","v":""},null,null,{"$f":"IF(E421=\"\",\"\",IF(COUNTIF(E$6:E420,E421)<1,\"初\",IFERROR(VLOOKUP(INDEX(F$1:F420,_xlfn.AGGREGATE(14,6,ROW(E$6:E420)/(E$6:E420=E421),1)),{\"申\",\"　\";\"　\",\"申\"},2,0),\"\")))","v":""},null,null,null,null,null,null,null,null," "]
[null,{"$f":"IF(C422<>1,\"\",1+INDEX(B:B,MATCH(MAX(B$1:B421)+1,B$1:B421, 1)))","v":""},{"$f":"IF(D422=\"\",\"\",IF(D422<D421,IF(1+INDEX(C:C,MATCH(MAX(C$1:C421)+1,C$1:C421, 1))>12,1,1+INDEX(C:C,MATCH(MAX(C$1:C421)+1,C$1:C421, 1))),\"\"))","v":""},null,null,{"$f":"IF(E422=\"\",\"\",IF(COUNTIF(E$6:E421,E422)<1,\"初\",IFERROR(VLOOKUP(INDEX(F$1:F421,_xlfn.AGGREGATE(14,6,ROW(E$6:E421)/(E$6:E421=E422),1)),{\"申\",\"　\";\"　\",\"申\"},2,0),\"\")))","v":""},null,null,null,null,null,null,null,null," "]
[null,{"$f":"IF(C423<>1,\"\",1+INDEX(B:B,MATCH(MAX(B$1:B422)+1,B$1:B422, 1)))","v":""},{"$f":"IF(D423=\"\",\"\",IF(D423<D422,IF(1+INDEX(C:C,MATCH(MAX(C$1:C422)+1,C$1:C422, 1))>12,1,1+INDEX(C:C,MATCH(MAX(C$1:C422)+1,C$1:C422, 1))),\"\"))","v":""},null,null,{"$f":"IF(E423=\"\",\"\",IF(COUNTIF(E$6:E422,E423)<1,\"初\",IFERROR(VLOOKUP(INDEX(F$1:F422,_xlfn.AGGREGATE(14,6,ROW(E$6:E422)/(E$6:E422=E423),1)),{\"申\",\"　\";\"　\",\"申\"},2,0),\"\")))","v":""},null,null,null,null,null,null,null,null," "]
[null,{"$f":"IF(C424<>1,\"\",1+INDEX(B:B,MATCH(MAX(B$1:B423)+1,B$1:B423, 1)))","v":""},{"$f":"IF(D424=\"\",\"\",IF(D424<D423,IF(1+INDEX(C:C,MATCH(MAX(C$1:C423)+1,C$1:C423, 1))>12,1,1+INDEX(C:C,MATCH(MAX(C$1:C423)+1,C$1:C423, 1))),\"\"))","v":""},null,null,{"$f":"IF(E424=\"\",\"\",IF(COUNTIF(E$6:E423,E424)<1,\"初\",IFERROR(VLOOKUP(INDEX(F$1:F423,_xlfn.AGGREGATE(14,6,ROW(E$6:E423)/(E$6:E423=E424),1)),{\"申\",\"　\";\"　\",\"申\"},2,0),\"\")))","v":""},null,null,null,null,null,null,null,null," "]
[null,{"$f":"IF(C425<>1,\"\",1+INDEX(B:B,MATCH(MAX(B$1:B424)+1,B$1:B424, 1)))","v":""},{"$f":"IF(D425=\"\",\"\",IF(D425<D424,IF(1+INDEX(C:C,MATCH(MAX(C$1:C424)+1,C$1:C424, 1))>12,1,1+INDEX(C:C,MATCH(MAX(C$1:C424)+1,C$1:C424, 1))),\"\"))","v":""},null,null,{"$f":"IF(E425=\"\",\"\",IF(COUNTIF(E$6:E424,E425)<1,\"初\",IFERROR(VLOOKUP(INDEX(F$1:F424,_xlfn.AGGREGATE(14,6,ROW(E$6:E424)/(E$6:E424=E425),1)),{\"申\",\"　\";\"　\",\"申\"},2,0),\"\")))","v":""},null,null,null,null,null,null,null,null," "]
[null,{"$f":"IF(C426<>1,\"\",1+INDEX(B:B,MATCH(MAX(B$1:B425)+1,B$1:B425, 1)))","v":""},{"$f":"IF(D426=\"\",\"\",IF(D426<D425,IF(1+INDEX(C:C,MATCH(MAX(C$1:C425)+1,C$1:C425, 1))>12,1,1+INDEX(C:C,MATCH(MAX(C$1:C425)+1,C$1:C425, 1))),\"\"))","v":""},null,null,{"$f":"IF(E426=\"\",\"\",IF(COUNTIF(E$6:E425,E426)<1,\"初\",IFERROR(VLOOKUP(INDEX(F$1:F425,_xlfn.AGGREGATE(14,6,ROW(E$6:E425)/(E$6:E425=E426),1)),{\"申\",\"　\";\"　\",\"申\"},2,0),\"\")))","v":""},null,null,null,null,null,null,null,null," "]
[null,{"$f":"IF(C427<>1,\"\",1+INDEX(B:B,MATCH(MAX(B$1:B426)+1,B$1:B426, 1)))","v":""},{"$f":"IF(D427=\"\",\"\",IF(D427<D426,IF(1+INDEX(C:C,MATCH(MAX(C$1:C426)+1,C$1:C426, 1))>12,1,1+INDEX(C:C,MATCH(MAX(C$1:C426)+1,C$1:C426, 1))),\"\"))","v":""},null,null,{"$f":"IF(E427=\"\",\"\",IF(COUNTIF(E$6:E426,E427)<1,\"初\",IFERROR(VLOOKUP(INDEX(F$1:F426,_xlfn.AGGREGATE(14,6,ROW(E$6:E426)/(E$6:E426=E427),1)),{\"申\",\"　\";\"　\",\"申\"},2,0),\"\")))","v":""},null,null,null,null,null,null,null,null," "]
[null,{"$f":"IF(C428<>1,\"\",1+INDEX(B:B,MATCH(MAX(B$1:B427)+1,B$1:B427, 1)))","v":""},{"$f":"IF(D428=\"\",\"\",IF(D428<D427,IF(1+INDEX(C:C,MATCH(MAX(C$1:C427)+1,C$1:C427, 1))>12,1,1+INDEX(C:C,MATCH(MAX(C$1:C427)+1,C$1:C427, 1))),\"\"))","v":""},null,null,{"$f":"IF(E428=\"\",\"\",IF(COUNTIF(E$6:E427,E428)<1,\"初\",IFERROR(VLOOKUP(INDEX(F$1:F427,_xlfn.AGGREGATE(14,6,ROW(E$6:E427)/(E$6:E427=E428),1)),{\"申\",\"　\";\"　\",\"申\"},2,0),\"\")))","v":""},null,null,null,null,null,null,null,null," "]
[null,{"$f":"IF(C429<>1,\"\",1+INDEX(B:B,MATCH(MAX(B$1:B428)+1,B$1:B428, 1)))","v":""},{"$f":"IF(D429=\"\",\"\",IF(D429<D428,IF(1+INDEX(C:C,MATCH(MAX(C$1:C428)+1,C$1:C428, 1))>12,1,1+INDEX(C:C,MATCH(MAX(C$1:C428)+1,C$1:C428, 1))),\"\"))","v":""},null,null,{"$f":"IF(E429=\"\",\"\",IF(COUNTIF(E$6:E428,E429)<1,\"初\",IFERROR(VLOOKUP(INDEX(F$1:F428,_xlfn.AGGREGATE(14,6,ROW(E$6:E428)/(E$6:E428=E429),1)),{\"申\",\"　\";\"　\",\"申\"},2,0),\"\")))","v":""},null,null,null,null,null,null,null,null," "]
[null,{"$f":"IF(C430<>1,\"\",1+INDEX(B:B,MATCH(MAX(B$1:B429)+1,B$1:B429, 1)))","v":""},{"$f":"IF(D430=\"\",\"\",IF(D430<D429,IF(1+INDEX(C:C,MATCH(MAX(C$1:C429)+1,C$1:C429, 1))>12,1,1+INDEX(C:C,MATCH(MAX(C$1:C429)+1,C$1:C429, 1))),\"\"))","v":""},null,null,{"$f":"IF(E430=\"\",\"\",IF(COUNTIF(E$6:E429,E430)<1,\"初\",IFERROR(VLOOKUP(INDEX(F$1:F429,_xlfn.AGGREGATE(14,6,ROW(E$6:E429)/(E$6:E429=E430),1)),{\"申\",\"　\";\"　\",\"申\"},2,0),\"\")))","v":""},null,null,null,null,null,null,null,null," "]
[null,{"$f":"IF(C431<>1,\"\",1+INDEX(B:B,MATCH(MAX(B$1:B430)+1,B$1:B430, 1)))","v":""},{"$f":"IF(D431=\"\",\"\",IF(D431<D430,IF(1+INDEX(C:C,MATCH(MAX(C$1:C430)+1,C$1:C430, 1))>12,1,1+INDEX(C:C,MATCH(MAX(C$1:C430)+1,C$1:C430, 1))),\"\"))","v":""},null,null,{"$f":"IF(E431=\"\",\"\",IF(COUNTIF(E$6:E430,E431)<1,\"初\",IFERROR(VLOOKUP(INDEX(F$1:F430,_xlfn.AGGREGATE(14,6,ROW(E$6:E430)/(E$6:E430=E431),1)),{\"申\",\"　\";\"　\",\"申\"},2,0),\"\")))","v":""},null,null,null,null,null,null,null,null," "]
[null,{"$f":"IF(C432<>1,\"\",1+INDEX(B:B,MATCH(MAX(B$1:B431)+1,B$1:B431, 1)))","v":""},{"$f":"IF(D432=\"\",\"\",IF(D432<D431,IF(1+INDEX(C:C,MATCH(MAX(C$1:C431)+1,C$1:C431, 1))>12,1,1+INDEX(C:C,MATCH(MAX(C$1:C431)+1,C$1:C431, 1))),\"\"))","v":""},null,null,{"$f":"IF(E432=\"\",\"\",IF(COUNTIF(E$6:E431,E432)<1,\"初\",IFERROR(VLOOKUP(INDEX(F$1:F431,_xlfn.AGGREGATE(14,6,ROW(E$6:E431)/(E$6:E431=E432),1)),{\"申\",\"　\";\"　\",\"申\"},2,0),\"\")))","v":""},null,null,null,null,null,null,null,null," "]
[null,{"$f":"IF(C433<>1,\"\",1+INDEX(B:B,MATCH(MAX(B$1:B432)+1,B$1:B432, 1)))","v":""},{"$f":"IF(D433=\"\",\"\",IF(D433<D432,IF(1+INDEX(C:C,MATCH(MAX(C$1:C432)+1,C$1:C432, 1))>12,1,1+INDEX(C:C,MATCH(MAX(C$1:C432)+1,C$1:C432, 1))),\"\"))","v":""},null,null,{"$f":"IF(E433=\"\",\"\",IF(COUNTIF(E$6:E432,E433)<1,\"初\",IFERROR(VLOOKUP(INDEX(F$1:F432,_xlfn.AGGREGATE(14,6,ROW(E$6:E432)/(E$6:E432=E433),1)),{\"申\",\"　\";\"　\",\"申\"},2,0),\"\")))","v":""},null,null,null,null,null,null,null,null," "]
[null,{"$f":"IF(C434<>1,\"\",1+INDEX(B:B,MATCH(MAX(B$1:B433)+1,B$1:B433, 1)))","v":""},{"$f":"IF(D434=\"\",\"\",IF(D434<D433,IF(1+INDEX(C:C,MATCH(MAX(C$1:C433)+1,C$1:C433, 1))>12,1,1+INDEX(C:C,MATCH(MAX(C$1:C433)+1,C$1:C433, 1))),\"\"))","v":""},null,null,{"$f":"IF(E434=\"\",\"\",IF(COUNTIF(E$6:E433,E434)<1,\"初\",IFERROR(VLOOKUP(INDEX(F$1:F433,_xlfn.AGGREGATE(14,6,ROW(E$6:E433)/(E$6:E433=E434),1)),{\"申\",\"　\";\"　\",\"申\"},2,0),\"\")))","v":""},null,null,null,null,null,null,null,null," "]
[null,{"$f":"IF(C435<>1,\"\",1+INDEX(B:B,MATCH(MAX(B$1:B434)+1,B$1:B434, 1)))","v":""},{"$f":"IF(D435=\"\",\"\",IF(D435<D434,IF(1+INDEX(C:C,MATCH(MAX(C$1:C434)+1,C$1:C434, 1))>12,1,1+INDEX(C:C,MATCH(MAX(C$1:C434)+1,C$1:C434, 1))),\"\"))","v":""},null,null,{"$f":"IF(E435=\"\",\"\",IF(COUNTIF(E$6:E434,E435)<1,\"初\",IFERROR(VLOOKUP(INDEX(F$1:F434,_xlfn.AGGREGATE(14,6,ROW(E$6:E434)/(E$6:E434=E435),1)),{\"申\",\"　\";\"　\",\"申\"},2,0),\"\")))","v":""},null,null,null,null,null,null,null,null," "]
[null,{"$f":"IF(C436<>1,\"\",1+INDEX(B:B,MATCH(MAX(B$1:B435)+1,B$1:B435, 1)))","v":""},{"$f":"IF(D436=\"\",\"\",IF(D436<D435,IF(1+INDEX(C:C,MATCH(MAX(C$1:C435)+1,C$1:C435, 1))>12,1,1+INDEX(C:C,MATCH(MAX(C$1:C435)+1,C$1:C435, 1))),\"\"))","v":""},null,null,{"$f":"IF(E436=\"\",\"\",IF(COUNTIF(E$6:E435,E436)<1,\"初\",IFERROR(VLOOKUP(INDEX(F$1:F435,_xlfn.AGGREGATE(14,6,ROW(E$6:E435)/(E$6:E435=E436),1)),{\"申\",\"　\";\"　\",\"申\"},2,0),\"\")))","v":""},null,null,null,null,null,null,null,null," "]
[null,{"$f":"IF(C437<>1,\"\",1+INDEX(B:B,MATCH(MAX(B$1:B436)+1,B$1:B436, 1)))","v":""},{"$f":"IF(D437=\"\",\"\",IF(D437<D436,IF(1+INDEX(C:C,MATCH(MAX(C$1:C436)+1,C$1:C436, 1))>12,1,1+INDEX(C:C,MATCH(MAX(C$1:C436)+1,C$1:C436, 1))),\"\"))","v":""},null,null,{"$f":"IF(E437=\"\",\"\",IF(COUNTIF(E$6:E436,E437)<1,\"初\",IFERROR(VLOOKUP(INDEX(F$1:F436,_xlfn.AGGREGATE(14,6,ROW(E$6:E436)/(E$6:E436=E437),1)),{\"申\",\"　\";\"　\",\"申\"},2,0),\"\")))","v":""},null,null,null,null,null,null,null,null," "]
[null,{"$f":"IF(C438<>1,\"\",1+INDEX(B:B,MATCH(MAX(B$1:B437)+1,B$1:B437, 1)))","v":""},{"$f":"IF(D438=\"\",\"\",IF(D438<D437,IF(1+INDEX(C:C,MATCH(MAX(C$1:C437)+1,C$1:C437, 1))>12,1,1+INDEX(C:C,MATCH(MAX(C$1:C437)+1,C$1:C437, 1))),\"\"))","v":""},null,null,{"$f":"IF(E438=\"\",\"\",IF(COUNTIF(E$6:E437,E438)<1,\"初\",IFERROR(VLOOKUP(INDEX(F$1:F437,_xlfn.AGGREGATE(14,6,ROW(E$6:E437)/(E$6:E437=E438),1)),{\"申\",\"　\";\"　\",\"申\"},2,0),\"\")))","v":""},null,null,null,null,null,null,null,null," "]
[null,{"$f":"IF(C439<>1,\"\",1+INDEX(B:B,MATCH(MAX(B$1:B438)+1,B$1:B438, 1)))","v":""},{"$f":"IF(D439=\"\",\"\",IF(D439<D438,IF(1+INDEX(C:C,MATCH(MAX(C$1:C438)+1,C$1:C438, 1))>12,1,1+INDEX(C:C,MATCH(MAX(C$1:C438)+1,C$1:C438, 1))),\"\"))","v":""},null,null,{"$f":"IF(E439=\"\",\"\",IF(COUNTIF(E$6:E438,E439)<1,\"初\",IFERROR(VLOOKUP(INDEX(F$1:F438,_xlfn.AGGREGATE(14,6,ROW(E$6:E438)/(E$6:E438=E439),1)),{\"申\",\"　\";\"　\",\"申\"},2,0),\"\")))","v":""},null,null,null,null,null,null,null,null," "]
[null,{"$f":"IF(C440<>1,\"\",1+INDEX(B:B,MATCH(MAX(B$1:B439)+1,B$1:B439, 1)))","v":""},{"$f":"IF(D440=\"\",\"\",IF(D440<D439,IF(1+INDEX(C:C,MATCH(MAX(C$1:C439)+1,C$1:C439, 1))>12,1,1+INDEX(C:C,MATCH(MAX(C$1:C439)+1,C$1:C439, 1))),\"\"))","v":""},null,null,{"$f":"IF(E440=\"\",\"\",IF(COUNTIF(E$6:E439,E440)<1,\"初\",IFERROR(VLOOKUP(INDEX(F$1:F439,_xlfn.AGGREGATE(14,6,ROW(E$6:E439)/(E$6:E439=E440),1)),{\"申\",\"　\";\"　\",\"申\"},2,0),\"\")))","v":""},null,null,null,null,null,null,null,null," "]
[null,{"$f":"IF(C441<>1,\"\",1+INDEX(B:B,MATCH(MAX(B$1:B440)+1,B$1:B440, 1)))","v":""},{"$f":"IF(D441=\"\",\"\",IF(D441<D440,IF(1+INDEX(C:C,MATCH(MAX(C$1:C440)+1,C$1:C440, 1))>12,1,1+INDEX(C:C,MATCH(MAX(C$1:C440)+1,C$1:C440, 1))),\"\"))","v":""},null,null,{"$f":"IF(E441=\"\",\"\",IF(COUNTIF(E$6:E440,E441)<1,\"初\",IFERROR(VLOOKUP(INDEX(F$1:F440,_xlfn.AGGREGATE(14,6,ROW(E$6:E440)/(E$6:E440=E441),1)),{\"申\",\"　\";\"　\",\"申\"},2,0),\"\")))","v":""},null,null,null,null,null,null,null,null," "]
[null,{"$f":"IF(C442<>1,\"\",1+INDEX(B:B,MATCH(MAX(B$1:B441)+1,B$1:B441, 1)))","v":""},{"$f":"IF(D442=\"\",\"\",IF(D442<D441,IF(1+INDEX(C:C,MATCH(MAX(C$1:C441)+1,C$1:C441, 1))>12,1,1+INDEX(C:C,MATCH(MAX(C$1:C441)+1,C$1:C441, 1))),\"\"))","v":""},null,null,{"$f":"IF(E442=\"\",\"\",IF(COUNTIF(E$6:E441,E442)<1,\"初\",IFERROR(VLOOKUP(INDEX(F$1:F441,_xlfn.AGGREGATE(14,6,ROW(E$6:E441)/(E$6:E441=E442),1)),{\"申\",\"　\";\"　\",\"申\"},2,0),\"\")))","v":""},null,null,null,null,null,null,null,null," "]
[null,{"$f":"IF(C443<>1,\"\",1+INDEX(B:B,MATCH(MAX(B$1:B442)+1,B$1:B442, 1)))","v":""},{"$f":"IF(D443=\"\",\"\",IF(D443<D442,IF(1+INDEX(C:C,MATCH(MAX(C$1:C442)+1,C$1:C442, 1))>12,1,1+INDEX(C:C,MATCH(MAX(C$1:C442)+1,C$1:C442, 1))),\"\"))","v":""},null,null,{"$f":"IF(E443=\"\",\"\",IF(COUNTIF(E$6:E442,E443)<1,\"初\",IFERROR(VLOOKUP(INDEX(F$1:F442,_xlfn.AGGREGATE(14,6,ROW(E$6:E442)/(E$6:E442=E443),1)),{\"申\",\"　\";\"　\",\"申\"},2,0),\"\")))","v":""},null,null,null,null,null,null,null,null," "]
[null,{"$f":"IF(C444<>1,\"\",1+INDEX(B:B,MATCH(MAX(B$1:B443)+1,B$1:B443, 1)))","v":""},{"$f":"IF(D444=\"\",\"\",IF(D444<D443,IF(1+INDEX(C:C,MATCH(MAX(C$1:C443)+1,C$1:C443, 1))>12,1,1+INDEX(C:C,MATCH(MAX(C$1:C443)+1,C$1:C443, 1))),\"\"))","v":""},null,null,{"$f":"IF(E444=\"\",\"\",IF(COUNTIF(E$6:E443,E444)<1,\"初\",IFERROR(VLOOKUP(INDEX(F$1:F443,_xlfn.AGGREGATE(14,6,ROW(E$6:E443)/(E$6:E443=E444),1)),{\"申\",\"　\";\"　\",\"申\"},2,0),\"\")))","v":""},null,null,null,null,null,null,null,null," "]
[null,{"$f":"IF(C445<>1,\"\",1+INDEX(B:B,MATCH(MAX(B$1:B444)+1,B$1:B444, 1)))","v":""},{"$f":"IF(D445=\"\",\"\",IF(D445<D444,IF(1+INDEX(C:C,MATCH(MAX(C$1:C444)+1,C$1:C444, 1))>12,1,1+INDEX(C:C,MATCH(MAX(C$1:C444)+1,C$1:C444, 1))),\"\"))","v":""},null,null,{"$f":"IF(E445=\"\",\"\",IF(COUNTIF(E$6:E444,E445)<1,\"初\",IFERROR(VLOOKUP(INDEX(F$1:F444,_xlfn.AGGREGATE(14,6,ROW(E$6:E444)/(E$6:E444=E445),1)),{\"申\",\"　\";\"　\",\"申\"},2,0),\"\")))","v":""},null,null,null,null,null,null,null,null," "]
[null,{"$f":"IF(C446<>1,\"\",1+INDEX(B:B,MATCH(MAX(B$1:B445)+1,B$1:B445, 1)))","v":""},{"$f":"IF(D446=\"\",\"\",IF(D446<D445,IF(1+INDEX(C:C,MATCH(MAX(C$1:C445)+1,C$1:C445, 1))>12,1,1+INDEX(C:C,MATCH(MAX(C$1:C445)+1,C$1:C445, 1))),\"\"))","v":""},null,null,{"$f":"IF(E446=\"\",\"\",IF(COUNTIF(E$6:E445,E446)<1,\"初\",IFERROR(VLOOKUP(INDEX(F$1:F445,_xlfn.AGGREGATE(14,6,ROW(E$6:E445)/(E$6:E445=E446),1)),{\"申\",\"　\";\"　\",\"申\"},2,0),\"\")))","v":""},null,null,null,null,null,null,null,null," "]
[null,{"$f":"IF(C447<>1,\"\",1+INDEX(B:B,MATCH(MAX(B$1:B446)+1,B$1:B446, 1)))","v":""},{"$f":"IF(D447=\"\",\"\",IF(D447<D446,IF(1+INDEX(C:C,MATCH(MAX(C$1:C446)+1,C$1:C446, 1))>12,1,1+INDEX(C:C,MATCH(MAX(C$1:C446)+1,C$1:C446, 1))),\"\"))","v":""},null,null,{"$f":"IF(E447=\"\",\"\",IF(COUNTIF(E$6:E446,E447)<1,\"初\",IFERROR(VLOOKUP(INDEX(F$1:F446,_xlfn.AGGREGATE(14,6,ROW(E$6:E446)/(E$6:E446=E447),1)),{\"申\",\"　\";\"　\",\"申\"},2,0),\"\")))","v":""},null,null,null,null,null,null,null,null," "]
[null,{"$f":"IF(C448<>1,\"\",1+INDEX(B:B,MATCH(MAX(B$1:B447)+1,B$1:B447, 1)))","v":""},{"$f":"IF(D448=\"\",\"\",IF(D448<D447,IF(1+INDEX(C:C,MATCH(MAX(C$1:C447)+1,C$1:C447, 1))>12,1,1+INDEX(C:C,MATCH(MAX(C$1:C447)+1,C$1:C447, 1))),\"\"))","v":""},null,null,{"$f":"IF(E448=\"\",\"\",IF(COUNTIF(E$6:E447,E448)<1,\"初\",IFERROR(VLOOKUP(INDEX(F$1:F447,_xlfn.AGGREGATE(14,6,ROW(E$6:E447)/(E$6:E447=E448),1)),{\"申\",\"　\";\"　\",\"申\"},2,0),\"\")))","v":""},null,null,null,null,null,null,null,null," "]
[null,{"$f":"IF(C449<>1,\"\",1+INDEX(B:B,MATCH(MAX(B$1:B448)+1,B$1:B448, 1)))","v":""},{"$f":"IF(D449=\"\",\"\",IF(D449<D448,IF(1+INDEX(C:C,MATCH(MAX(C$1:C448)+1,C$1:C448, 1))>12,1,1+INDEX(C:C,MATCH(MAX(C$1:C448)+1,C$1:C448, 1))),\"\"))","v":""},null,null,{"$f":"IF(E449=\"\",\"\",IF(COUNTIF(E$6:E448,E449)<1,\"初\",IFERROR(VLOOKUP(INDEX(F$1:F448,_xlfn.AGGREGATE(14,6,ROW(E$6:E448)/(E$6:E448=E449),1)),{\"申\",\"　\";\"　\",\"申\"},2,0),\"\")))","v":""},null,null,null,null,null,null,null,null," "]
[null,{"$f":"IF(C450<>1,\"\",1+INDEX(B:B,MATCH(MAX(B$1:B449)+1,B$1:B449, 1)))","v":""},{"$f":"IF(D450=\"\",\"\",IF(D450<D449,IF(1+INDEX(C:C,MATCH(MAX(C$1:C449)+1,C$1:C449, 1))>12,1,1+INDEX(C:C,MATCH(MAX(C$1:C449)+1,C$1:C449, 1))),\"\"))","v":""},null,null,{"$f":"IF(E450=\"\",\"\",IF(COUNTIF(E$6:E449,E450)<1,\"初\",IFERROR(VLOOKUP(INDEX(F$1:F449,_xlfn.AGGREGATE(14,6,ROW(E$6:E449)/(E$6:E449=E450),1)),{\"申\",\"　\";\"　\",\"申\"},2,0),\"\")))","v":""},null,null,null,null,null,null,null,null," "]
[null,{"$f":"IF(C451<>1,\"\",1+INDEX(B:B,MATCH(MAX(B$1:B450)+1,B$1:B450, 1)))","v":""},{"$f":"IF(D451=\"\",\"\",IF(D451<D450,IF(1+INDEX(C:C,MATCH(MAX(C$1:C450)+1,C$1:C450, 1))>12,1,1+INDEX(C:C,MATCH(MAX(C$1:C450)+1,C$1:C450, 1))),\"\"))","v":""},null,null,{"$f":"IF(E451=\"\",\"\",IF(COUNTIF(E$6:E450,E451)<1,\"初\",IFERROR(VLOOKUP(INDEX(F$1:F450,_xlfn.AGGREGATE(14,6,ROW(E$6:E450)/(E$6:E450=E451),1)),{\"申\",\"　\";\"　\",\"申\"},2,0),\"\")))","v":""},null,null,null,null,null,null,null,null," "]
[null,{"$f":"IF(C452<>1,\"\",1+INDEX(B:B,MATCH(MAX(B$1:B451)+1,B$1:B451, 1)))","v":""},{"$f":"IF(D452=\"\",\"\",IF(D452<D451,IF(1+INDEX(C:C,MATCH(MAX(C$1:C451)+1,C$1:C451, 1))>12,1,1+INDEX(C:C,MATCH(MAX(C$1:C451)+1,C$1:C451, 1))),\"\"))","v":""},null,null,{"$f":"IF(E452=\"\",\"\",IF(COUNTIF(E$6:E451,E452)<1,\"初\",IFERROR(VLOOKUP(INDEX(F$1:F451,_xlfn.AGGREGATE(14,6,ROW(E$6:E451)/(E$6:E451=E452),1)),{\"申\",\"　\";\"　\",\"申\"},2,0),\"\")))","v":""},null,null,null,null,null,null,null,null," "]
[null,{"$f":"IF(C453<>1,\"\",1+INDEX(B:B,MATCH(MAX(B$1:B452)+1,B$1:B452, 1)))","v":""},{"$f":"IF(D453=\"\",\"\",IF(D453<D452,IF(1+INDEX(C:C,MATCH(MAX(C$1:C452)+1,C$1:C452, 1))>12,1,1+INDEX(C:C,MATCH(MAX(C$1:C452)+1,C$1:C452, 1))),\"\"))","v":""},null,null,{"$f":"IF(E453=\"\",\"\",IF(COUNTIF(E$6:E452,E453)<1,\"初\",IFERROR(VLOOKUP(INDEX(F$1:F452,_xlfn.AGGREGATE(14,6,ROW(E$6:E452)/(E$6:E452=E453),1)),{\"申\",\"　\";\"　\",\"申\"},2,0),\"\")))","v":""},null,null,null,null,null,null,null,null," "]
[null,{"$f":"IF(C454<>1,\"\",1+INDEX(B:B,MATCH(MAX(B$1:B453)+1,B$1:B453, 1)))","v":""},{"$f":"IF(D454=\"\",\"\",IF(D454<D453,IF(1+INDEX(C:C,MATCH(MAX(C$1:C453)+1,C$1:C453, 1))>12,1,1+INDEX(C:C,MATCH(MAX(C$1:C453)+1,C$1:C453, 1))),\"\"))","v":""},null,null,{"$f":"IF(E454=\"\",\"\",IF(COUNTIF(E$6:E453,E454)<1,\"初\",IFERROR(VLOOKUP(INDEX(F$1:F453,_xlfn.AGGREGATE(14,6,ROW(E$6:E453)/(E$6:E453=E454),1)),{\"申\",\"　\";\"　\",\"申\"},2,0),\"\")))","v":""},null,null,null,null,null,null,null,null," "]
[null,{"$f":"IF(C455<>1,\"\",1+INDEX(B:B,MATCH(MAX(B$1:B454)+1,B$1:B454, 1)))","v":""},{"$f":"IF(D455=\"\",\"\",IF(D455<D454,IF(1+INDEX(C:C,MATCH(MAX(C$1:C454)+1,C$1:C454, 1))>12,1,1+INDEX(C:C,MATCH(MAX(C$1:C454)+1,C$1:C454, 1))),\"\"))","v":""},null,null,{"$f":"IF(E455=\"\",\"\",IF(COUNTIF(E$6:E454,E455)<1,\"初\",IFERROR(VLOOKUP(INDEX(F$1:F454,_xlfn.AGGREGATE(14,6,ROW(E$6:E454)/(E$6:E454=E455),1)),{\"申\",\"　\";\"　\",\"申\"},2,0),\"\")))","v":""},null,null,null,null,null,null,null,null," "]
[null,{"$f":"IF(C456<>1,\"\",1+INDEX(B:B,MATCH(MAX(B$1:B455)+1,B$1:B455, 1)))","v":""},{"$f":"IF(D456=\"\",\"\",IF(D456<D455,IF(1+INDEX(C:C,MATCH(MAX(C$1:C455)+1,C$1:C455, 1))>12,1,1+INDEX(C:C,MATCH(MAX(C$1:C455)+1,C$1:C455, 1))),\"\"))","v":""},null,null,{"$f":"IF(E456=\"\",\"\",IF(COUNTIF(E$6:E455,E456)<1,\"初\",IFERROR(VLOOKUP(INDEX(F$1:F455,_xlfn.AGGREGATE(14,6,ROW(E$6:E455)/(E$6:E455=E456),1)),{\"申\",\"　\";\"　\",\"申\"},2,0),\"\")))","v":""},null,null,null,null,null,null,null,null," "]
[null,{"$f":"IF(C457<>1,\"\",1+INDEX(B:B,MATCH(MAX(B$1:B456)+1,B$1:B456, 1)))","v":""},{"$f":"IF(D457=\"\",\"\",IF(D457<D456,IF(1+INDEX(C:C,MATCH(MAX(C$1:C456)+1,C$1:C456, 1))>12,1,1+INDEX(C:C,MATCH(MAX(C$1:C456)+1,C$1:C456, 1))),\"\"))","v":""},null,null,{"$f":"IF(E457=\"\",\"\",IF(COUNTIF(E$6:E456,E457)<1,\"初\",IFERROR(VLOOKUP(INDEX(F$1:F456,_xlfn.AGGREGATE(14,6,ROW(E$6:E456)/(E$6:E456=E457),1)),{\"申\",\"　\";\"　\",\"申\"},2,0),\"\")))","v":""},null,null,null,null,null,null,null,null," "]
[null,{"$f":"IF(C458<>1,\"\",1+INDEX(B:B,MATCH(MAX(B$1:B457)+1,B$1:B457, 1)))","v":""},{"$f":"IF(D458=\"\",\"\",IF(D458<D457,IF(1+INDEX(C:C,MATCH(MAX(C$1:C457)+1,C$1:C457, 1))>12,1,1+INDEX(C:C,MATCH(MAX(C$1:C457)+1,C$1:C457, 1))),\"\"))","v":""},null,null,{"$f":"IF(E458=\"\",\"\",IF(COUNTIF(E$6:E457,E458)<1,\"初\",IFERROR(VLOOKUP(INDEX(F$1:F457,_xlfn.AGGREGATE(14,6,ROW(E$6:E457)/(E$6:E457=E458),1)),{\"申\",\"　\";\"　\",\"申\"},2,0),\"\")))","v":""},null,null,null,null,null,null,null,null," "]
[null,{"$f":"IF(C459<>1,\"\",1+INDEX(B:B,MATCH(MAX(B$1:B458)+1,B$1:B458, 1)))","v":""},{"$f":"IF(D459=\"\",\"\",IF(D459<D458,IF(1+INDEX(C:C,MATCH(MAX(C$1:C458)+1,C$1:C458, 1))>12,1,1+INDEX(C:C,MATCH(MAX(C$1:C458)+1,C$1:C458, 1))),\"\"))","v":""},null,null,{"$f":"IF(E459=\"\",\"\",IF(COUNTIF(E$6:E458,E459)<1,\"初\",IFERROR(VLOOKUP(INDEX(F$1:F458,_xlfn.AGGREGATE(14,6,ROW(E$6:E458)/(E$6:E458=E459),1)),{\"申\",\"　\";\"　\",\"申\"},2,0),\"\")))","v":""},null,null,null,null,null,null,null,null," "]
[null,{"$f":"IF(C460<>1,\"\",1+INDEX(B:B,MATCH(MAX(B$1:B459)+1,B$1:B459, 1)))","v":""},{"$f":"IF(D460=\"\",\"\",IF(D460<D459,IF(1+INDEX(C:C,MATCH(MAX(C$1:C459)+1,C$1:C459, 1))>12,1,1+INDEX(C:C,MATCH(MAX(C$1:C459)+1,C$1:C459, 1))),\"\"))","v":""},null,null,{"$f":"IF(E460=\"\",\"\",IF(COUNTIF(E$6:E459,E460)<1,\"初\",IFERROR(VLOOKUP(INDEX(F$1:F459,_xlfn.AGGREGATE(14,6,ROW(E$6:E459)/(E$6:E459=E460),1)),{\"申\",\"　\";\"　\",\"申\"},2,0),\"\")))","v":""},null,null,null,null,null,null,null,null," "]
[null,{"$f":"IF(C461<>1,\"\",1+INDEX(B:B,MATCH(MAX(B$1:B460)+1,B$1:B460, 1)))","v":""},{"$f":"IF(D461=\"\",\"\",IF(D461<D460,IF(1+INDEX(C:C,MATCH(MAX(C$1:C460)+1,C$1:C460, 1))>12,1,1+INDEX(C:C,MATCH(MAX(C$1:C460)+1,C$1:C460, 1))),\"\"))","v":""},null,null,{"$f":"IF(E461=\"\",\"\",IF(COUNTIF(E$6:E460,E461)<1,\"初\",IFERROR(VLOOKUP(INDEX(F$1:F460,_xlfn.AGGREGATE(14,6,ROW(E$6:E460)/(E$6:E460=E461),1)),{\"申\",\"　\";\"　\",\"申\"},2,0),\"\")))","v":""},null,null,null,null,null,null,null,null," "]
[null,{"$f":"IF(C462<>1,\"\",1+INDEX(B:B,MATCH(MAX(B$1:B461)+1,B$1:B461, 1)))","v":""},{"$f":"IF(D462=\"\",\"\",IF(D462<D461,IF(1+INDEX(C:C,MATCH(MAX(C$1:C461)+1,C$1:C461, 1))>12,1,1+INDEX(C:C,MATCH(MAX(C$1:C461)+1,C$1:C461, 1))),\"\"))","v":""},null,null,{"$f":"IF(E462=\"\",\"\",IF(COUNTIF(E$6:E461,E462)<1,\"初\",IFERROR(VLOOKUP(INDEX(F$1:F461,_xlfn.AGGREGATE(14,6,ROW(E$6:E461)/(E$6:E461=E462),1)),{\"申\",\"　\";\"　\",\"申\"},2,0),\"\")))","v":""},null,null,null,null,null,null,null,null," "]
[null,{"$f":"IF(C463<>1,\"\",1+INDEX(B:B,MATCH(MAX(B$1:B462)+1,B$1:B462, 1)))","v":""},{"$f":"IF(D463=\"\",\"\",IF(D463<D462,IF(1+INDEX(C:C,MATCH(MAX(C$1:C462)+1,C$1:C462, 1))>12,1,1+INDEX(C:C,MATCH(MAX(C$1:C462)+1,C$1:C462, 1))),\"\"))","v":""},null,null,{"$f":"IF(E463=\"\",\"\",IF(COUNTIF(E$6:E462,E463)<1,\"初\",IFERROR(VLOOKUP(INDEX(F$1:F462,_xlfn.AGGREGATE(14,6,ROW(E$6:E462)/(E$6:E462=E463),1)),{\"申\",\"　\";\"　\",\"申\"},2,0),\"\")))","v":""},null,null,null,null,null,null,null,null," "]
[null,{"$f":"IF(C464<>1,\"\",1+INDEX(B:B,MATCH(MAX(B$1:B463)+1,B$1:B463, 1)))","v":""},{"$f":"IF(D464=\"\",\"\",IF(D464<D463,IF(1+INDEX(C:C,MATCH(MAX(C$1:C463)+1,C$1:C463, 1))>12,1,1+INDEX(C:C,MATCH(MAX(C$1:C463)+1,C$1:C463, 1))),\"\"))","v":""},null,null,{"$f":"IF(E464=\"\",\"\",IF(COUNTIF(E$6:E463,E464)<1,\"初\",IFERROR(VLOOKUP(INDEX(F$1:F463,_xlfn.AGGREGATE(14,6,ROW(E$6:E463)/(E$6:E463=E464),1)),{\"申\",\"　\";\"　\",\"申\"},2,0),\"\")))","v":""},null,null,null,null,null,null,null,null," "]
[null,{"$f":"IF(C465<>1,\"\",1+INDEX(B:B,MATCH(MAX(B$1:B464)+1,B$1:B464, 1)))","v":""},{"$f":"IF(D465=\"\",\"\",IF(D465<D464,IF(1+INDEX(C:C,MATCH(MAX(C$1:C464)+1,C$1:C464, 1))>12,1,1+INDEX(C:C,MATCH(MAX(C$1:C464)+1,C$1:C464, 1))),\"\"))","v":""},null,null,{"$f":"IF(E465=\"\",\"\",IF(COUNTIF(E$6:E464,E465)<1,\"初\",IFERROR(VLOOKUP(INDEX(F$1:F464,_xlfn.AGGREGATE(14,6,ROW(E$6:E464)/(E$6:E464=E465),1)),{\"申\",\"　\";\"　\",\"申\"},2,0),\"\")))","v":""},null,null,null,null,null,null,null,null," "]
[null,{"$f":"IF(C466<>1,\"\",1+INDEX(B:B,MATCH(MAX(B$1:B465)+1,B$1:B465, 1)))","v":""},{"$f":"IF(D466=\"\",\"\",IF(D466<D465,IF(1+INDEX(C:C,MATCH(MAX(C$1:C465)+1,C$1:C465, 1))>12,1,1+INDEX(C:C,MATCH(MAX(C$1:C465)+1,C$1:C465, 1))),\"\"))","v":""},null,null,{"$f":"IF(E466=\"\",\"\",IF(COUNTIF(E$6:E465,E466)<1,\"初\",IFERROR(VLOOKUP(INDEX(F$1:F465,_xlfn.AGGREGATE(14,6,ROW(E$6:E465)/(E$6:E465=E466),1)),{\"申\",\"　\";\"　\",\"申\"},2,0),\"\")))","v":""},null,null,null,null,null,null,null,null," "]
[null,{"$f":"IF(C467<>1,\"\",1+INDEX(B:B,MATCH(MAX(B$1:B466)+1,B$1:B466, 1)))","v":""},{"$f":"IF(D467=\"\",\"\",IF(D467<D466,IF(1+INDEX(C:C,MATCH(MAX(C$1:C466)+1,C$1:C466, 1))>12,1,1+INDEX(C:C,MATCH(MAX(C$1:C466)+1,C$1:C466, 1))),\"\"))","v":""},null,null,{"$f":"IF(E467=\"\",\"\",IF(COUNTIF(E$6:E466,E467)<1,\"初\",IFERROR(VLOOKUP(INDEX(F$1:F466,_xlfn.AGGREGATE(14,6,ROW(E$6:E466)/(E$6:E466=E467),1)),{\"申\",\"　\";\"　\",\"申\"},2,0),\"\")))","v":""},null,null,null,null,null,null,null,null," "]
[null,{"$f":"IF(C468<>1,\"\",1+INDEX(B:B,MATCH(MAX(B$1:B467)+1,B$1:B467, 1)))","v":""},{"$f":"IF(D468=\"\",\"\",IF(D468<D467,IF(1+INDEX(C:C,MATCH(MAX(C$1:C467)+1,C$1:C467, 1))>12,1,1+INDEX(C:C,MATCH(MAX(C$1:C467)+1,C$1:C467, 1))),\"\"))","v":""},null,null,{"$f":"IF(E468=\"\",\"\",IF(COUNTIF(E$6:E467,E468)<1,\"初\",IFERROR(VLOOKUP(INDEX(F$1:F467,_xlfn.AGGREGATE(14,6,ROW(E$6:E467)/(E$6:E467=E468),1)),{\"申\",\"　\";\"　\",\"申\"},2,0),\"\")))","v":""},null,null,null,null,null,null,null,null," "]
[null,{"$f":"IF(C469<>1,\"\",1+INDEX(B:B,MATCH(MAX(B$1:B468)+1,B$1:B468, 1)))","v":""},{"$f":"IF(D469=\"\",\"\",IF(D469<D468,IF(1+INDEX(C:C,MATCH(MAX(C$1:C468)+1,C$1:C468, 1))>12,1,1+INDEX(C:C,MATCH(MAX(C$1:C468)+1,C$1:C468, 1))),\"\"))","v":""},null,null,{"$f":"IF(E469=\"\",\"\",IF(COUNTIF(E$6:E468,E469)<1,\"初\",IFERROR(VLOOKUP(INDEX(F$1:F468,_xlfn.AGGREGATE(14,6,ROW(E$6:E468)/(E$6:E468=E469),1)),{\"申\",\"　\";\"　\",\"申\"},2,0),\"\")))","v":""},null,null,null,null,null,null,null,null," "]
[null,{"$f":"IF(C470<>1,\"\",1+INDEX(B:B,MATCH(MAX(B$1:B469)+1,B$1:B469, 1)))","v":""},{"$f":"IF(D470=\"\",\"\",IF(D470<D469,IF(1+INDEX(C:C,MATCH(MAX(C$1:C469)+1,C$1:C469, 1))>12,1,1+INDEX(C:C,MATCH(MAX(C$1:C469)+1,C$1:C469, 1))),\"\"))","v":""},null,null,{"$f":"IF(E470=\"\",\"\",IF(COUNTIF(E$6:E469,E470)<1,\"初\",IFERROR(VLOOKUP(INDEX(F$1:F469,_xlfn.AGGREGATE(14,6,ROW(E$6:E469)/(E$6:E469=E470),1)),{\"申\",\"　\";\"　\",\"申\"},2,0),\"\")))","v":""},null,null,null,null,null,null,null,null," "]
[null,{"$f":"IF(C471<>1,\"\",1+INDEX(B:B,MATCH(MAX(B$1:B470)+1,B$1:B470, 1)))","v":""},{"$f":"IF(D471=\"\",\"\",IF(D471<D470,IF(1+INDEX(C:C,MATCH(MAX(C$1:C470)+1,C$1:C470, 1))>12,1,1+INDEX(C:C,MATCH(MAX(C$1:C470)+1,C$1:C470, 1))),\"\"))","v":""},null,null,{"$f":"IF(E471=\"\",\"\",IF(COUNTIF(E$6:E470,E471)<1,\"初\",IFERROR(VLOOKUP(INDEX(F$1:F470,_xlfn.AGGREGATE(14,6,ROW(E$6:E470)/(E$6:E470=E471),1)),{\"申\",\"　\";\"　\",\"申\"},2,0),\"\")))","v":""},null,null,null,null,null,null,null,null," "]
[null,{"$f":"IF(C472<>1,\"\",1+INDEX(B:B,MATCH(MAX(B$1:B471)+1,B$1:B471, 1)))","v":""},{"$f":"IF(D472=\"\",\"\",IF(D472<D471,IF(1+INDEX(C:C,MATCH(MAX(C$1:C471)+1,C$1:C471, 1))>12,1,1+INDEX(C:C,MATCH(MAX(C$1:C471)+1,C$1:C471, 1))),\"\"))","v":""},null,null,{"$f":"IF(E472=\"\",\"\",IF(COUNTIF(E$6:E471,E472)<1,\"初\",IFERROR(VLOOKUP(INDEX(F$1:F471,_xlfn.AGGREGATE(14,6,ROW(E$6:E471)/(E$6:E471=E472),1)),{\"申\",\"　\";\"　\",\"申\"},2,0),\"\")))","v":""},null,null,null,null,null,null,null,null," "]
[null,{"$f":"IF(C473<>1,\"\",1+INDEX(B:B,MATCH(MAX(B$1:B472)+1,B$1:B472, 1)))","v":""},{"$f":"IF(D473=\"\",\"\",IF(D473<D472,IF(1+INDEX(C:C,MATCH(MAX(C$1:C472)+1,C$1:C472, 1))>12,1,1+INDEX(C:C,MATCH(MAX(C$1:C472)+1,C$1:C472, 1))),\"\"))","v":""},null,null,{"$f":"IF(E473=\"\",\"\",IF(COUNTIF(E$6:E472,E473)<1,\"初\",IFERROR(VLOOKUP(INDEX(F$1:F472,_xlfn.AGGREGATE(14,6,ROW(E$6:E472)/(E$6:E472=E473),1)),{\"申\",\"　\";\"　\",\"申\"},2,0),\"\")))","v":""},null,null,null,null,null,null,null,null," "]
[null,{"$f":"IF(C474<>1,\"\",1+INDEX(B:B,MATCH(MAX(B$1:B473)+1,B$1:B473, 1)))","v":""},{"$f":"IF(D474=\"\",\"\",IF(D474<D473,IF(1+INDEX(C:C,MATCH(MAX(C$1:C473)+1,C$1:C473, 1))>12,1,1+INDEX(C:C,MATCH(MAX(C$1:C473)+1,C$1:C473, 1))),\"\"))","v":""},null,null,{"$f":"IF(E474=\"\",\"\",IF(COUNTIF(E$6:E473,E474)<1,\"初\",IFERROR(VLOOKUP(INDEX(F$1:F473,_xlfn.AGGREGATE(14,6,ROW(E$6:E473)/(E$6:E473=E474),1)),{\"申\",\"　\";\"　\",\"申\"},2,0),\"\")))","v":""},null,null,null,null,null,null,null,null," "]
[null,{"$f":"IF(C475<>1,\"\",1+INDEX(B:B,MATCH(MAX(B$1:B474)+1,B$1:B474, 1)))","v":""},{"$f":"IF(D475=\"\",\"\",IF(D475<D474,IF(1+INDEX(C:C,MATCH(MAX(C$1:C474)+1,C$1:C474, 1))>12,1,1+INDEX(C:C,MATCH(MAX(C$1:C474)+1,C$1:C474, 1))),\"\"))","v":""},null,null,{"$f":"IF(E475=\"\",\"\",IF(COUNTIF(E$6:E474,E475)<1,\"初\",IFERROR(VLOOKUP(INDEX(F$1:F474,_xlfn.AGGREGATE(14,6,ROW(E$6:E474)/(E$6:E474=E475),1)),{\"申\",\"　\";\"　\",\"申\"},2,0),\"\")))","v":""},null,null,null,null,null,null,null,null," "]
[null,{"$f":"IF(C476<>1,\"\",1+INDEX(B:B,MATCH(MAX(B$1:B475)+1,B$1:B475, 1)))","v":""},{"$f":"IF(D476=\"\",\"\",IF(D476<D475,IF(1+INDEX(C:C,MATCH(MAX(C$1:C475)+1,C$1:C475, 1))>12,1,1+INDEX(C:C,MATCH(MAX(C$1:C475)+1,C$1:C475, 1))),\"\"))","v":""},null,null,{"$f":"IF(E476=\"\",\"\",IF(COUNTIF(E$6:E475,E476)<1,\"初\",IFERROR(VLOOKUP(INDEX(F$1:F475,_xlfn.AGGREGATE(14,6,ROW(E$6:E475)/(E$6:E475=E476),1)),{\"申\",\"　\";\"　\",\"申\"},2,0),\"\")))","v":""},null,null,null,null,null,null,null,null," "]
[null,{"$f":"IF(C477<>1,\"\",1+INDEX(B:B,MATCH(MAX(B$1:B476)+1,B$1:B476, 1)))","v":""},{"$f":"IF(D477=\"\",\"\",IF(D477<D476,IF(1+INDEX(C:C,MATCH(MAX(C$1:C476)+1,C$1:C476, 1))>12,1,1+INDEX(C:C,MATCH(MAX(C$1:C476)+1,C$1:C476, 1))),\"\"))","v":""},null,null,{"$f":"IF(E477=\"\",\"\",IF(COUNTIF(E$6:E476,E477)<1,\"初\",IFERROR(VLOOKUP(INDEX(F$1:F476,_xlfn.AGGREGATE(14,6,ROW(E$6:E476)/(E$6:E476=E477),1)),{\"申\",\"　\";\"　\",\"申\"},2,0),\"\")))","v":""},null,null,null,null,null,null,null,null," "]
[null,{"$f":"IF(C478<>1,\"\",1+INDEX(B:B,MATCH(MAX(B$1:B477)+1,B$1:B477, 1)))","v":""},{"$f":"IF(D478=\"\",\"\",IF(D478<D477,IF(1+INDEX(C:C,MATCH(MAX(C$1:C477)+1,C$1:C477, 1))>12,1,1+INDEX(C:C,MATCH(MAX(C$1:C477)+1,C$1:C477, 1))),\"\"))","v":""},null,null,{"$f":"IF(E478=\"\",\"\",IF(COUNTIF(E$6:E477,E478)<1,\"初\",IFERROR(VLOOKUP(INDEX(F$1:F477,_xlfn.AGGREGATE(14,6,ROW(E$6:E477)/(E$6:E477=E478),1)),{\"申\",\"　\";\"　\",\"申\"},2,0),\"\")))","v":""},null,null,null,null,null,null,null,null," "]
[null,{"$f":"IF(C479<>1,\"\",1+INDEX(B:B,MATCH(MAX(B$1:B478)+1,B$1:B478, 1)))","v":""},{"$f":"IF(D479=\"\",\"\",IF(D479<D478,IF(1+INDEX(C:C,MATCH(MAX(C$1:C478)+1,C$1:C478, 1))>12,1,1+INDEX(C:C,MATCH(MAX(C$1:C478)+1,C$1:C478, 1))),\"\"))","v":""},null,null,{"$f":"IF(E479=\"\",\"\",IF(COUNTIF(E$6:E478,E479)<1,\"初\",IFERROR(VLOOKUP(INDEX(F$1:F478,_xlfn.AGGREGATE(14,6,ROW(E$6:E478)/(E$6:E478=E479),1)),{\"申\",\"　\";\"　\",\"申\"},2,0),\"\")))","v":""},null,null,null,null,null,null,null,null,{"$f":"IF(ISERROR(LEFT(E479,FIND(\"　\",E479,1)-1)&\" \"&LEFT(G479,FIND(\"　\",G479,1)-1)&\" \"&K479&L479&\" \"&H479&IF(I479<>\"\",\"or\"&I479,\"\")&J479&M479&N479), \"\", LEFT(E479,FIND(\"　\",E479,1)-1)&\" \"&LEFT(G479,FIND(\"　\",G479,1)-1)&\" \"&K479&L479&\" \"&H479&IF(I479<>\"\",\"or\"&I479,\"\")&J479&M479&N479)&\" \"&F479","v":" "}]
[null,{"$f":"IF(C480<>1,\"\",1+INDEX(B:B,MATCH(MAX(B$1:B479)+1,B$1:B479, 1)))","v":""},{"$f":"IF(D480=\"\",\"\",IF(D480<D479,IF(1+INDEX(C:C,MATCH(MAX(C$1:C479)+1,C$1:C479, 1))>12,1,1+INDEX(C:C,MATCH(MAX(C$1:C479)+1,C$1:C479, 1))),\"\"))","v":""},null,null,{"$f":"IF(E480=\"\",\"\",IF(COUNTIF(E$6:E479,E480)<1,\"初\",IFERROR(VLOOKUP(INDEX(F$1:F479,_xlfn.AGGREGATE(14,6,ROW(E$6:E479)/(E$6:E479=E480),1)),{\"申\",\"　\";\"　\",\"申\"},2,0),\"\")))","v":""},null,null,null,null,null,null,null,null," "]
[null,{"$f":"IF(C481<>1,\"\",1+INDEX(B:B,MATCH(MAX(B$1:B480)+1,B$1:B480, 1)))","v":""},{"$f":"IF(D481=\"\",\"\",IF(D481<D480,IF(1+INDEX(C:C,MATCH(MAX(C$1:C480)+1,C$1:C480, 1))>12,1,1+INDEX(C:C,MATCH(MAX(C$1:C480)+1,C$1:C480, 1))),\"\"))","v":""},null,null,{"$f":"IF(E481=\"\",\"\",IF(COUNTIF(E$6:E480,E481)<1,\"初\",IFERROR(VLOOKUP(INDEX(F$1:F480,_xlfn.AGGREGATE(14,6,ROW(E$6:E480)/(E$6:E480=E481),1)),{\"申\",\"　\";\"　\",\"申\"},2,0),\"\")))","v":""},null,null,null,null,null,null,null,null," "]
[null,{"$f":"IF(C482<>1,\"\",1+INDEX(B:B,MATCH(MAX(B$1:B481)+1,B$1:B481, 1)))","v":""},{"$f":"IF(D482=\"\",\"\",IF(D482<D481,IF(1+INDEX(C:C,MATCH(MAX(C$1:C481)+1,C$1:C481, 1))>12,1,1+INDEX(C:C,MATCH(MAX(C$1:C481)+1,C$1:C481, 1))),\"\"))","v":""},null,null,{"$f":"IF(E482=\"\",\"\",IF(COUNTIF(E$6:E481,E482)<1,\"初\",IFERROR(VLOOKUP(INDEX(F$1:F481,_xlfn.AGGREGATE(14,6,ROW(E$6:E481)/(E$6:E481=E482),1)),{\"申\",\"　\";\"　\",\"申\"},2,0),\"\")))","v":""},null,null,null,null,null,null,null,null," "]
[null,{"$f":"IF(C483<>1,\"\",1+INDEX(B:B,MATCH(MAX(B$1:B482)+1,B$1:B482, 1)))","v":""},{"$f":"IF(D483=\"\",\"\",IF(D483<D482,IF(1+INDEX(C:C,MATCH(MAX(C$1:C482)+1,C$1:C482, 1))>12,1,1+INDEX(C:C,MATCH(MAX(C$1:C482)+1,C$1:C482, 1))),\"\"))","v":""},null,null,{"$f":"IF(E483=\"\",\"\",IF(COUNTIF(E$6:E482,E483)<1,\"初\",IFERROR(VLOOKUP(INDEX(F$1:F482,_xlfn.AGGREGATE(14,6,ROW(E$6:E482)/(E$6:E482=E483),1)),{\"申\",\"　\";\"　\",\"申\"},2,0),\"\")))","v":""},null,null,null,null,null,null,null,null," "]
[null,{"$f":"IF(C484<>1,\"\",1+INDEX(B:B,MATCH(MAX(B$1:B483)+1,B$1:B483, 1)))","v":""},{"$f":"IF(D484=\"\",\"\",IF(D484<D483,IF(1+INDEX(C:C,MATCH(MAX(C$1:C483)+1,C$1:C483, 1))>12,1,1+INDEX(C:C,MATCH(MAX(C$1:C483)+1,C$1:C483, 1))),\"\"))","v":""},null,null,{"$f":"IF(E484=\"\",\"\",IF(COUNTIF(E$6:E483,E484)<1,\"初\",IFERROR(VLOOKUP(INDEX(F$1:F483,_xlfn.AGGREGATE(14,6,ROW(E$6:E483)/(E$6:E483=E484),1)),{\"申\",\"　\";\"　\",\"申\"},2,0),\"\")))","v":""},null,null,null,null,null,null,null,null," "]
[null,{"$f":"IF(C485<>1,\"\",1+INDEX(B:B,MATCH(MAX(B$1:B484)+1,B$1:B484, 1)))","v":""},{"$f":"IF(D485=\"\",\"\",IF(D485<D484,IF(1+INDEX(C:C,MATCH(MAX(C$1:C484)+1,C$1:C484, 1))>12,1,1+INDEX(C:C,MATCH(MAX(C$1:C484)+1,C$1:C484, 1))),\"\"))","v":""},null,null,{"$f":"IF(E485=\"\",\"\",IF(COUNTIF(E$6:E484,E485)<1,\"初\",IFERROR(VLOOKUP(INDEX(F$1:F484,_xlfn.AGGREGATE(14,6,ROW(E$6:E484)/(E$6:E484=E485),1)),{\"申\",\"　\";\"　\",\"申\"},2,0),\"\")))","v":""},null,null,null,null,null,null,null,null," "]
[null,{"$f":"IF(C486<>1,\"\",1+INDEX(B:B,MATCH(MAX(B$1:B485)+1,B$1:B485, 1)))","v":""},{"$f":"IF(D486=\"\",\"\",IF(D486<D485,IF(1+INDEX(C:C,MATCH(MAX(C$1:C485)+1,C$1:C485, 1))>12,1,1+INDEX(C:C,MATCH(MAX(C$1:C485)+1,C$1:C485, 1))),\"\"))","v":""},null,null,{"$f":"IF(E486=\"\",\"\",IF(COUNTIF(E$6:E485,E486)<1,\"初\",IFERROR(VLOOKUP(INDEX(F$1:F485,_xlfn.AGGREGATE(14,6,ROW(E$6:E485)/(E$6:E485=E486),1)),{\"申\",\"　\";\"　\",\"申\"},2,0),\"\")))","v":""},null,null,null,null,null,null,null,null," "]
[null,{"$f":"IF(C487<>1,\"\",1+INDEX(B:B,MATCH(MAX(B$1:B486)+1,B$1:B486, 1)))","v":""},{"$f":"IF(D487=\"\",\"\",IF(D487<D486,IF(1+INDEX(C:C,MATCH(MAX(C$1:C486)+1,C$1:C486, 1))>12,1,1+INDEX(C:C,MATCH(MAX(C$1:C486)+1,C$1:C486, 1))),\"\"))","v":""},null,null,{"$f":"IF(E487=\"\",\"\",IF(COUNTIF(E$6:E486,E487)<1,\"初\",IFERROR(VLOOKUP(INDEX(F$1:F486,_xlfn.AGGREGATE(14,6,ROW(E$6:E486)/(E$6:E486=E487),1)),{\"申\",\"　\";\"　\",\"申\"},2,0),\"\")))","v":""},null,null,null,null,null,null,null,null," "]
[null,{"$f":"IF(C488<>1,\"\",1+INDEX(B:B,MATCH(MAX(B$1:B487)+1,B$1:B487, 1)))","v":""},{"$f":"IF(D488=\"\",\"\",IF(D488<D487,IF(1+INDEX(C:C,MATCH(MAX(C$1:C487)+1,C$1:C487, 1))>12,1,1+INDEX(C:C,MATCH(MAX(C$1:C487)+1,C$1:C487, 1))),\"\"))","v":""},null,null,{"$f":"IF(E488=\"\",\"\",IF(COUNTIF(E$6:E487,E488)<1,\"初\",IFERROR(VLOOKUP(INDEX(F$1:F487,_xlfn.AGGREGATE(14,6,ROW(E$6:E487)/(E$6:E487=E488),1)),{\"申\",\"　\";\"　\",\"申\"},2,0),\"\")))","v":""},null,null,null,null,null,null,null,null," "]
[null,{"$f":"IF(C489<>1,\"\",1+INDEX(B:B,MATCH(MAX(B$1:B488)+1,B$1:B488, 1)))","v":""},{"$f":"IF(D489=\"\",\"\",IF(D489<D488,IF(1+INDEX(C:C,MATCH(MAX(C$1:C488)+1,C$1:C488, 1))>12,1,1+INDEX(C:C,MATCH(MAX(C$1:C488)+1,C$1:C488, 1))),\"\"))","v":""},null,null,{"$f":"IF(E489=\"\",\"\",IF(COUNTIF(E$6:E488,E489)<1,\"初\",IFERROR(VLOOKUP(INDEX(F$1:F488,_xlfn.AGGREGATE(14,6,ROW(E$6:E488)/(E$6:E488=E489),1)),{\"申\",\"　\";\"　\",\"申\"},2,0),\"\")))","v":""},null,null,null,null,null,null,null,null," "]
[null,{"$f":"IF(C490<>1,\"\",1+INDEX(B:B,MATCH(MAX(B$1:B489)+1,B$1:B489, 1)))","v":""},{"$f":"IF(D490=\"\",\"\",IF(D490<D489,IF(1+INDEX(C:C,MATCH(MAX(C$1:C489)+1,C$1:C489, 1))>12,1,1+INDEX(C:C,MATCH(MAX(C$1:C489)+1,C$1:C489, 1))),\"\"))","v":""},null,null,{"$f":"IF(E490=\"\",\"\",IF(COUNTIF(E$6:E489,E490)<1,\"初\",IFERROR(VLOOKUP(INDEX(F$1:F489,_xlfn.AGGREGATE(14,6,ROW(E$6:E489)/(E$6:E489=E490),1)),{\"申\",\"　\";\"　\",\"申\"},2,0),\"\")))","v":""},null,null,null,null,null,null,null,null," "]
[null,{"$f":"IF(C491<>1,\"\",1+INDEX(B:B,MATCH(MAX(B$1:B490)+1,B$1:B490, 1)))","v":""},{"$f":"IF(D491=\"\",\"\",IF(D491<D490,IF(1+INDEX(C:C,MATCH(MAX(C$1:C490)+1,C$1:C490, 1))>12,1,1+INDEX(C:C,MATCH(MAX(C$1:C490)+1,C$1:C490, 1))),\"\"))","v":""},null,null,{"$f":"IF(E491=\"\",\"\",IF(COUNTIF(E$6:E490,E491)<1,\"初\",IFERROR(VLOOKUP(INDEX(F$1:F490,_xlfn.AGGREGATE(14,6,ROW(E$6:E490)/(E$6:E490=E491),1)),{\"申\",\"　\";\"　\",\"申\"},2,0),\"\")))","v":""},null,null,null,null,null,null,null,null," "]
[null,{"$f":"IF(C492<>1,\"\",1+INDEX(B:B,MATCH(MAX(B$1:B491)+1,B$1:B491, 1)))","v":""},{"$f":"IF(D492=\"\",\"\",IF(D492<D491,IF(1+INDEX(C:C,MATCH(MAX(C$1:C491)+1,C$1:C491, 1))>12,1,1+INDEX(C:C,MATCH(MAX(C$1:C491)+1,C$1:C491, 1))),\"\"))","v":""},null,null,{"$f":"IF(E492=\"\",\"\",IF(COUNTIF(E$6:E491,E492)<1,\"初\",IFERROR(VLOOKUP(INDEX(F$1:F491,_xlfn.AGGREGATE(14,6,ROW(E$6:E491)/(E$6:E491=E492),1)),{\"申\",\"　\";\"　\",\"申\"},2,0),\"\")))","v":""},null,null,null,null,null,null,null,null," "]
[null,{"$f":"IF(C493<>1,\"\",1+INDEX(B:B,MATCH(MAX(B$1:B492)+1,B$1:B492, 1)))","v":""},{"$f":"IF(D493=\"\",\"\",IF(D493<D492,IF(1+INDEX(C:C,MATCH(MAX(C$1:C492)+1,C$1:C492, 1))>12,1,1+INDEX(C:C,MATCH(MAX(C$1:C492)+1,C$1:C492, 1))),\"\"))","v":""},null,null,{"$f":"IF(E493=\"\",\"\",IF(COUNTIF(E$6:E492,E493)<1,\"初\",IFERROR(VLOOKUP(INDEX(F$1:F492,_xlfn.AGGREGATE(14,6,ROW(E$6:E492)/(E$6:E492=E493),1)),{\"申\",\"　\";\"　\",\"申\"},2,0),\"\")))","v":""},null,null,null,null,null,null,null,null," "]
[null,{"$f":"IF(C494<>1,\"\",1+INDEX(B:B,MATCH(MAX(B$1:B493)+1,B$1:B493, 1)))","v":""},{"$f":"IF(D494=\"\",\"\",IF(D494<D493,IF(1+INDEX(C:C,MATCH(MAX(C$1:C493)+1,C$1:C493, 1))>12,1,1+INDEX(C:C,MATCH(MAX(C$1:C493)+1,C$1:C493, 1))),\"\"))","v":""},null,null,{"$f":"IF(E494=\"\",\"\",IF(COUNTIF(E$6:E493,E494)<1,\"初\",IFERROR(VLOOKUP(INDEX(F$1:F493,_xlfn.AGGREGATE(14,6,ROW(E$6:E493)/(E$6:E493=E494),1)),{\"申\",\"　\";\"　\",\"申\"},2,0),\"\")))","v":""},null,null,null,null,null,null,null,null," "]
[null,{"$f":"IF(C495<>1,\"\",1+INDEX(B:B,MATCH(MAX(B$1:B494)+1,B$1:B494, 1)))","v":""},{"$f":"IF(D495=\"\",\"\",IF(D495<D494,IF(1+INDEX(C:C,MATCH(MAX(C$1:C494)+1,C$1:C494, 1))>12,1,1+INDEX(C:C,MATCH(MAX(C$1:C494)+1,C$1:C494, 1))),\"\"))","v":""},null,null,{"$f":"IF(E495=\"\",\"\",IF(COUNTIF(E$6:E494,E495)<1,\"初\",IFERROR(VLOOKUP(INDEX(F$1:F494,_xlfn.AGGREGATE(14,6,ROW(E$6:E494)/(E$6:E494=E495),1)),{\"申\",\"　\";\"　\",\"申\"},2,0),\"\")))","v":""},null,null,null,null,null,null,null,null," "]
[null,{"$f":"IF(C496<>1,\"\",1+INDEX(B:B,MATCH(MAX(B$1:B495)+1,B$1:B495, 1)))","v":""},{"$f":"IF(D496=\"\",\"\",IF(D496<D495,IF(1+INDEX(C:C,MATCH(MAX(C$1:C495)+1,C$1:C495, 1))>12,1,1+INDEX(C:C,MATCH(MAX(C$1:C495)+1,C$1:C495, 1))),\"\"))","v":""},null,null,{"$f":"IF(E496=\"\",\"\",IF(COUNTIF(E$6:E495,E496)<1,\"初\",IFERROR(VLOOKUP(INDEX(F$1:F495,_xlfn.AGGREGATE(14,6,ROW(E$6:E495)/(E$6:E495=E496),1)),{\"申\",\"　\";\"　\",\"申\"},2,0),\"\")))","v":""},null,null,null,null,null,null,null,null," "]
[null,{"$f":"IF(C497<>1,\"\",1+INDEX(B:B,MATCH(MAX(B$1:B496)+1,B$1:B496, 1)))","v":""},{"$f":"IF(D497=\"\",\"\",IF(D497<D496,IF(1+INDEX(C:C,MATCH(MAX(C$1:C496)+1,C$1:C496, 1))>12,1,1+INDEX(C:C,MATCH(MAX(C$1:C496)+1,C$1:C496, 1))),\"\"))","v":""},null,null,{"$f":"IF(E497=\"\",\"\",IF(COUNTIF(E$6:E496,E497)<1,\"初\",IFERROR(VLOOKUP(INDEX(F$1:F496,_xlfn.AGGREGATE(14,6,ROW(E$6:E496)/(E$6:E496=E497),1)),{\"申\",\"　\";\"　\",\"申\"},2,0),\"\")))","v":""},null,null,null,null,null,null,null,null," "]
[null,{"$f":"IF(C498<>1,\"\",1+INDEX(B:B,MATCH(MAX(B$1:B497)+1,B$1:B497, 1)))","v":""},{"$f":"IF(D498=\"\",\"\",IF(D498<D497,IF(1+INDEX(C:C,MATCH(MAX(C$1:C497)+1,C$1:C497, 1))>12,1,1+INDEX(C:C,MATCH(MAX(C$1:C497)+1,C$1:C497, 1))),\"\"))","v":""},null,null,{"$f":"IF(E498=\"\",\"\",IF(COUNTIF(E$6:E497,E498)<1,\"初\",IFERROR(VLOOKUP(INDEX(F$1:F497,_xlfn.AGGREGATE(14,6,ROW(E$6:E497)/(E$6:E497=E498),1)),{\"申\",\"　\";\"　\",\"申\"},2,0),\"\")))","v":""},null,null,null,null,null,null,null,null," "]
[null,{"$f":"IF(C499<>1,\"\",1+INDEX(B:B,MATCH(MAX(B$1:B498)+1,B$1:B498, 1)))","v":""},{"$f":"IF(D499=\"\",\"\",IF(D499<D498,IF(1+INDEX(C:C,MATCH(MAX(C$1:C498)+1,C$1:C498, 1))>12,1,1+INDEX(C:C,MATCH(MAX(C$1:C498)+1,C$1:C498, 1))),\"\"))","v":""},null,null,{"$f":"IF(E499=\"\",\"\",IF(COUNTIF(E$6:E498,E499)<1,\"初\",IFERROR(VLOOKUP(INDEX(F$1:F498,_xlfn.AGGREGATE(14,6,ROW(E$6:E498)/(E$6:E498=E499),1)),{\"申\",\"　\";\"　\",\"申\"},2,0),\"\")))","v":""},null,null,null,null,null,null,null,null," "]
[null,{"$f":"IF(C500<>1,\"\",1+INDEX(B:B,MATCH(MAX(B$1:B499)+1,B$1:B499, 1)))","v":""},{"$f":"IF(D500=\"\",\"\",IF(D500<D499,IF(1+INDEX(C:C,MATCH(MAX(C$1:C499)+1,C$1:C499, 1))>12,1,1+INDEX(C:C,MATCH(MAX(C$1:C499)+1,C$1:C499, 1))),\"\"))","v":""},null,null,{"$f":"IF(E500=\"\",\"\",IF(COUNTIF(E$6:E499,E500)<1,\"初\",IFERROR(VLOOKUP(INDEX(F$1:F499,_xlfn.AGGREGATE(14,6,ROW(E$6:E499)/(E$6:E499=E500),1)),{\"申\",\"　\";\"　\",\"申\"},2,0),\"\")))","v":""},null,null,null,null,null,null,null,null," "]
[null,{"$f":"IF(C501<>1,\"\",1+INDEX(B:B,MATCH(MAX(B$1:B500)+1,B$1:B500, 1)))","v":""},{"$f":"IF(D501=\"\",\"\",IF(D501<D500,IF(1+INDEX(C:C,MATCH(MAX(C$1:C500)+1,C$1:C500, 1))>12,1,1+INDEX(C:C,MATCH(MAX(C$1:C500)+1,C$1:C500, 1))),\"\"))","v":""},null,null,{"$f":"IF(E501=\"\",\"\",IF(COUNTIF(E$6:E500,E501)<1,\"初\",IFERROR(VLOOKUP(INDEX(F$1:F500,_xlfn.AGGREGATE(14,6,ROW(E$6:E500)/(E$6:E500=E501),1)),{\"申\",\"　\";\"　\",\"申\"},2,0),\"\")))","v":""},null,null,null,null,null,null,null,null," "]
[null,{"$f":"IF(C502<>1,\"\",1+INDEX(B:B,MATCH(MAX(B$1:B501)+1,B$1:B501, 1)))","v":""},{"$f":"IF(D502=\"\",\"\",IF(D502<D501,IF(1+INDEX(C:C,MATCH(MAX(C$1:C501)+1,C$1:C501, 1))>12,1,1+INDEX(C:C,MATCH(MAX(C$1:C501)+1,C$1:C501, 1))),\"\"))","v":""},null,null,{"$f":"IF(E502=\"\",\"\",IF(COUNTIF(E$6:E501,E502)<1,\"初\",IFERROR(VLOOKUP(INDEX(F$1:F501,_xlfn.AGGREGATE(14,6,ROW(E$6:E501)/(E$6:E501=E502),1)),{\"申\",\"　\";\"　\",\"申\"},2,0),\"\")))","v":""},null,null,null,null,null,null,null,null," "]
[null,{"$f":"IF(C503<>1,\"\",1+INDEX(B:B,MATCH(MAX(B$1:B502)+1,B$1:B502, 1)))","v":""},{"$f":"IF(D503=\"\",\"\",IF(D503<D502,IF(1+INDEX(C:C,MATCH(MAX(C$1:C502)+1,C$1:C502, 1))>12,1,1+INDEX(C:C,MATCH(MAX(C$1:C502)+1,C$1:C502, 1))),\"\"))","v":""},null,null,{"$f":"IF(E503=\"\",\"\",IF(COUNTIF(E$6:E502,E503)<1,\"初\",IFERROR(VLOOKUP(INDEX(F$1:F502,_xlfn.AGGREGATE(14,6,ROW(E$6:E502)/(E$6:E502=E503),1)),{\"申\",\"　\";\"　\",\"申\"},2,0),\"\")))","v":""},null,null,null,null,null,null,null,null," "]
[null,{"$f":"IF(C504<>1,\"\",1+INDEX(B:B,MATCH(MAX(B$1:B503)+1,B$1:B503, 1)))","v":""},{"$f":"IF(D504=\"\",\"\",IF(D504<D503,IF(1+INDEX(C:C,MATCH(MAX(C$1:C503)+1,C$1:C503, 1))>12,1,1+INDEX(C:C,MATCH(MAX(C$1:C503)+1,C$1:C503, 1))),\"\"))","v":""},null,null,{"$f":"IF(E504=\"\",\"\",IF(COUNTIF(E$6:E503,E504)<1,\"初\",IFERROR(VLOOKUP(INDEX(F$1:F503,_xlfn.AGGREGATE(14,6,ROW(E$6:E503)/(E$6:E503=E504),1)),{\"申\",\"　\";\"　\",\"申\"},2,0),\"\")))","v":""},null,null,null,null,null,null,null,null," "]
[null,{"$f":"IF(C505<>1,\"\",1+INDEX(B:B,MATCH(MAX(B$1:B504)+1,B$1:B504, 1)))","v":""},{"$f":"IF(D505=\"\",\"\",IF(D505<D504,IF(1+INDEX(C:C,MATCH(MAX(C$1:C504)+1,C$1:C504, 1))>12,1,1+INDEX(C:C,MATCH(MAX(C$1:C504)+1,C$1:C504, 1))),\"\"))","v":""},null,null,{"$f":"IF(E505=\"\",\"\",IF(COUNTIF(E$6:E504,E505)<1,\"初\",IFERROR(VLOOKUP(INDEX(F$1:F504,_xlfn.AGGREGATE(14,6,ROW(E$6:E504)/(E$6:E504=E505),1)),{\"申\",\"　\";\"　\",\"申\"},2,0),\"\")))","v":""},null,null,null,null,null,null,null,null," "]
[null,{"$f":"IF(C506<>1,\"\",1+INDEX(B:B,MATCH(MAX(B$1:B505)+1,B$1:B505, 1)))","v":""},{"$f":"IF(D506=\"\",\"\",IF(D506<D505,IF(1+INDEX(C:C,MATCH(MAX(C$1:C505)+1,C$1:C505, 1))>12,1,1+INDEX(C:C,MATCH(MAX(C$1:C505)+1,C$1:C505, 1))),\"\"))","v":""},null,null,{"$f":"IF(E506=\"\",\"\",IF(COUNTIF(E$6:E505,E506)<1,\"初\",IFERROR(VLOOKUP(INDEX(F$1:F505,_xlfn.AGGREGATE(14,6,ROW(E$6:E505)/(E$6:E505=E506),1)),{\"申\",\"　\";\"　\",\"申\"},2,0),\"\")))","v":""},null,null,null,null,null,null,null,null," "]
[null,{"$f":"IF(C507<>1,\"\",1+INDEX(B:B,MATCH(MAX(B$1:B506)+1,B$1:B506, 1)))","v":""},{"$f":"IF(D507=\"\",\"\",IF(D507<D506,IF(1+INDEX(C:C,MATCH(MAX(C$1:C506)+1,C$1:C506, 1))>12,1,1+INDEX(C:C,MATCH(MAX(C$1:C506)+1,C$1:C506, 1))),\"\"))","v":""},null,null,{"$f":"IF(E507=\"\",\"\",IF(COUNTIF(E$6:E506,E507)<1,\"初\",IFERROR(VLOOKUP(INDEX(F$1:F506,_xlfn.AGGREGATE(14,6,ROW(E$6:E506)/(E$6:E506=E507),1)),{\"申\",\"　\";\"　\",\"申\"},2,0),\"\")))","v":""},null,null,null,null,null,null,null,null," "]
[null,{"$f":"IF(C508<>1,\"\",1+INDEX(B:B,MATCH(MAX(B$1:B507)+1,B$1:B507, 1)))","v":""},{"$f":"IF(D508=\"\",\"\",IF(D508<D507,IF(1+INDEX(C:C,MATCH(MAX(C$1:C507)+1,C$1:C507, 1))>12,1,1+INDEX(C:C,MATCH(MAX(C$1:C507)+1,C$1:C507, 1))),\"\"))","v":""},null,null,{"$f":"IF(E508=\"\",\"\",IF(COUNTIF(E$6:E507,E508)<1,\"初\",IFERROR(VLOOKUP(INDEX(F$1:F507,_xlfn.AGGREGATE(14,6,ROW(E$6:E507)/(E$6:E507=E508),1)),{\"申\",\"　\";\"　\",\"申\"},2,0),\"\")))","v":""},null,null,null,null,null,null,null,null," "]
[null,{"$f":"IF(C509<>1,\"\",1+INDEX(B:B,MATCH(MAX(B$1:B508)+1,B$1:B508, 1)))","v":""},{"$f":"IF(D509=\"\",\"\",IF(D509<D508,IF(1+INDEX(C:C,MATCH(MAX(C$1:C508)+1,C$1:C508, 1))>12,1,1+INDEX(C:C,MATCH(MAX(C$1:C508)+1,C$1:C508, 1))),\"\"))","v":""},null,null,{"$f":"IF(E509=\"\",\"\",IF(COUNTIF(E$6:E508,E509)<1,\"初\",IFERROR(VLOOKUP(INDEX(F$1:F508,_xlfn.AGGREGATE(14,6,ROW(E$6:E508)/(E$6:E508=E509),1)),{\"申\",\"　\";\"　\",\"申\"},2,0),\"\")))","v":""},null,null,null,null,null,null,null,null," "]
[null,{"$f":"IF(C510<>1,\"\",1+INDEX(B:B,MATCH(MAX(B$1:B509)+1,B$1:B509, 1)))","v":""},{"$f":"IF(D510=\"\",\"\",IF(D510<D509,IF(1+INDEX(C:C,MATCH(MAX(C$1:C509)+1,C$1:C509, 1))>12,1,1+INDEX(C:C,MATCH(MAX(C$1:C509)+1,C$1:C509, 1))),\"\"))","v":""},null,null,{"$f":"IF(E510=\"\",\"\",IF(COUNTIF(E$6:E509,E510)<1,\"初\",IFERROR(VLOOKUP(INDEX(F$1:F509,_xlfn.AGGREGATE(14,6,ROW(E$6:E509)/(E$6:E509=E510),1)),{\"申\",\"　\";\"　\",\"申\"},2,0),\"\")))","v":""},null,null,null,null,null,null,null,null," "]
[null,{"$f":"IF(C511<>1,\"\",1+INDEX(B:B,MATCH(MAX(B$1:B510)+1,B$1:B510, 1)))","v":""},{"$f":"IF(D511=\"\",\"\",IF(D511<D510,IF(1+INDEX(C:C,MATCH(MAX(C$1:C510)+1,C$1:C510, 1))>12,1,1+INDEX(C:C,MATCH(MAX(C$1:C510)+1,C$1:C510, 1))),\"\"))","v":""},null,null,{"$f":"IF(E511=\"\",\"\",IF(COUNTIF(E$6:E510,E511)<1,\"初\",IFERROR(VLOOKUP(INDEX(F$1:F510,_xlfn.AGGREGATE(14,6,ROW(E$6:E510)/(E$6:E510=E511),1)),{\"申\",\"　\";\"　\",\"申\"},2,0),\"\")))","v":""},null,null,null,null,null,null,null,null," "]
[null,{"$f":"IF(C512<>1,\"\",1+INDEX(B:B,MATCH(MAX(B$1:B511)+1,B$1:B511, 1)))","v":""},{"$f":"IF(D512=\"\",\"\",IF(D512<D511,IF(1+INDEX(C:C,MATCH(MAX(C$1:C511)+1,C$1:C511, 1))>12,1,1+INDEX(C:C,MATCH(MAX(C$1:C511)+1,C$1:C511, 1))),\"\"))","v":""},null,null,{"$f":"IF(E512=\"\",\"\",IF(COUNTIF(E$6:E511,E512)<1,\"初\",IFERROR(VLOOKUP(INDEX(F$1:F511,_xlfn.AGGREGATE(14,6,ROW(E$6:E511)/(E$6:E511=E512),1)),{\"申\",\"　\";\"　\",\"申\"},2,0),\"\")))","v":""},null,null,null,null,null,null,null,null," "]
[null,{"$f":"IF(C513<>1,\"\",1+INDEX(B:B,MATCH(MAX(B$1:B512)+1,B$1:B512, 1)))","v":""},{"$f":"IF(D513=\"\",\"\",IF(D513<D512,IF(1+INDEX(C:C,MATCH(MAX(C$1:C512)+1,C$1:C512, 1))>12,1,1+INDEX(C:C,MATCH(MAX(C$1:C512)+1,C$1:C512, 1))),\"\"))","v":""},null,null,{"$f":"IF(E513=\"\",\"\",IF(COUNTIF(E$6:E512,E513)<1,\"初\",IFERROR(VLOOKUP(INDEX(F$1:F512,_xlfn.AGGREGATE(14,6,ROW(E$6:E512)/(E$6:E512=E513),1)),{\"申\",\"　\";\"　\",\"申\"},2,0),\"\")))","v":""},null,null,null,null,null,null,null,null," "]
[null,{"$f":"IF(C514<>1,\"\",1+INDEX(B:B,MATCH(MAX(B$1:B513)+1,B$1:B513, 1)))","v":""},{"$f":"IF(D514=\"\",\"\",IF(D514<D513,IF(1+INDEX(C:C,MATCH(MAX(C$1:C513)+1,C$1:C513, 1))>12,1,1+INDEX(C:C,MATCH(MAX(C$1:C513)+1,C$1:C513, 1))),\"\"))","v":""},null,null,{"$f":"IF(E514=\"\",\"\",IF(COUNTIF(E$6:E513,E514)<1,\"初\",IFERROR(VLOOKUP(INDEX(F$1:F513,_xlfn.AGGREGATE(14,6,ROW(E$6:E513)/(E$6:E513=E514),1)),{\"申\",\"　\";\"　\",\"申\"},2,0),\"\")))","v":""},null,null,null,null,null,null,null,null," "]
[null,{"$f":"IF(C515<>1,\"\",1+INDEX(B:B,MATCH(MAX(B$1:B514)+1,B$1:B514, 1)))","v":""},{"$f":"IF(D515=\"\",\"\",IF(D515<D514,IF(1+INDEX(C:C,MATCH(MAX(C$1:C514)+1,C$1:C514, 1))>12,1,1+INDEX(C:C,MATCH(MAX(C$1:C514)+1,C$1:C514, 1))),\"\"))","v":""},null,null,{"$f":"IF(E515=\"\",\"\",IF(COUNTIF(E$6:E514,E515)<1,\"初\",IFERROR(VLOOKUP(INDEX(F$1:F514,_xlfn.AGGREGATE(14,6,ROW(E$6:E514)/(E$6:E514=E515),1)),{\"申\",\"　\";\"　\",\"申\"},2,0),\"\")))","v":""},null,null,null,null,null,null,null,null," "]
[null,{"$f":"IF(C516<>1,\"\",1+INDEX(B:B,MATCH(MAX(B$1:B515)+1,B$1:B515, 1)))","v":""},{"$f":"IF(D516=\"\",\"\",IF(D516<D515,IF(1+INDEX(C:C,MATCH(MAX(C$1:C515)+1,C$1:C515, 1))>12,1,1+INDEX(C:C,MATCH(MAX(C$1:C515)+1,C$1:C515, 1))),\"\"))","v":""},null,null,{"$f":"IF(E516=\"\",\"\",IF(COUNTIF(E$6:E515,E516)<1,\"初\",IFERROR(VLOOKUP(INDEX(F$1:F515,_xlfn.AGGREGATE(14,6,ROW(E$6:E515)/(E$6:E515=E516),1)),{\"申\",\"　\";\"　\",\"申\"},2,0),\"\")))","v":""},null,null,null,null,null,null,null,null," "]
[null,{"$f":"IF(C517<>1,\"\",1+INDEX(B:B,MATCH(MAX(B$1:B516)+1,B$1:B516, 1)))","v":""},{"$f":"IF(D517=\"\",\"\",IF(D517<D516,IF(1+INDEX(C:C,MATCH(MAX(C$1:C516)+1,C$1:C516, 1))>12,1,1+INDEX(C:C,MATCH(MAX(C$1:C516)+1,C$1:C516, 1))),\"\"))","v":""},null,null,{"$f":"IF(E517=\"\",\"\",IF(COUNTIF(E$6:E516,E517)<1,\"初\",IFERROR(VLOOKUP(INDEX(F$1:F516,_xlfn.AGGREGATE(14,6,ROW(E$6:E516)/(E$6:E516=E517),1)),{\"申\",\"　\";\"　\",\"申\"},2,0),\"\")))","v":""},null,null,null,null,null,null,null,null," "]
[null,{"$f":"IF(C518<>1,\"\",1+INDEX(B:B,MATCH(MAX(B$1:B517)+1,B$1:B517, 1)))","v":""},{"$f":"IF(D518=\"\",\"\",IF(D518<D517,IF(1+INDEX(C:C,MATCH(MAX(C$1:C517)+1,C$1:C517, 1))>12,1,1+INDEX(C:C,MATCH(MAX(C$1:C517)+1,C$1:C517, 1))),\"\"))","v":""},null,null,{"$f":"IF(E518=\"\",\"\",IF(COUNTIF(E$6:E517,E518)<1,\"初\",IFERROR(VLOOKUP(INDEX(F$1:F517,_xlfn.AGGREGATE(14,6,ROW(E$6:E517)/(E$6:E517=E518),1)),{\"申\",\"　\";\"　\",\"申\"},2,0),\"\")))","v":""},null,null,null,null,null,null,null,null," "]
[null,{"$f":"IF(C519<>1,\"\",1+INDEX(B:B,MATCH(MAX(B$1:B518)+1,B$1:B518, 1)))","v":""},{"$f":"IF(D519=\"\",\"\",IF(D519<D518,IF(1+INDEX(C:C,MATCH(MAX(C$1:C518)+1,C$1:C518, 1))>12,1,1+INDEX(C:C,MATCH(MAX(C$1:C518)+1,C$1:C518, 1))),\"\"))","v":""},null,null,{"$f":"IF(E519=\"\",\"\",IF(COUNTIF(E$6:E518,E519)<1,\"初\",IFERROR(VLOOKUP(INDEX(F$1:F518,_xlfn.AGGREGATE(14,6,ROW(E$6:E518)/(E$6:E518=E519),1)),{\"申\",\"　\";\"　\",\"申\"},2,0),\"\")))","v":""},null,null,null,null,null,null,null,null," "]
[null,{"$f":"IF(C520<>1,\"\",1+INDEX(B:B,MATCH(MAX(B$1:B519)+1,B$1:B519, 1)))","v":""},{"$f":"IF(D520=\"\",\"\",IF(D520<D519,IF(1+INDEX(C:C,MATCH(MAX(C$1:C519)+1,C$1:C519, 1))>12,1,1+INDEX(C:C,MATCH(MAX(C$1:C519)+1,C$1:C519, 1))),\"\"))","v":""},null,null,{"$f":"IF(E520=\"\",\"\",IF(COUNTIF(E$6:E519,E520)<1,\"初\",IFERROR(VLOOKUP(INDEX(F$1:F519,_xlfn.AGGREGATE(14,6,ROW(E$6:E519)/(E$6:E519=E520),1)),{\"申\",\"　\";\"　\",\"申\"},2,0),\"\")))","v":""},null,null,null,null,null,null,null,null," "]
[null,{"$f":"IF(C521<>1,\"\",1+INDEX(B:B,MATCH(MAX(B$1:B520)+1,B$1:B520, 1)))","v":""},{"$f":"IF(D521=\"\",\"\",IF(D521<D520,IF(1+INDEX(C:C,MATCH(MAX(C$1:C520)+1,C$1:C520, 1))>12,1,1+INDEX(C:C,MATCH(MAX(C$1:C520)+1,C$1:C520, 1))),\"\"))","v":""},null,null,{"$f":"IF(E521=\"\",\"\",IF(COUNTIF(E$6:E520,E521)<1,\"初\",IFERROR(VLOOKUP(INDEX(F$1:F520,_xlfn.AGGREGATE(14,6,ROW(E$6:E520)/(E$6:E520=E521),1)),{\"申\",\"　\";\"　\",\"申\"},2,0),\"\")))","v":""},null,null,null,null,null,null,null,null," "]
[null,{"$f":"IF(C522<>1,\"\",1+INDEX(B:B,MATCH(MAX(B$1:B521)+1,B$1:B521, 1)))","v":""},{"$f":"IF(D522=\"\",\"\",IF(D522<D521,IF(1+INDEX(C:C,MATCH(MAX(C$1:C521)+1,C$1:C521, 1))>12,1,1+INDEX(C:C,MATCH(MAX(C$1:C521)+1,C$1:C521, 1))),\"\"))","v":""},null,null,{"$f":"IF(E522=\"\",\"\",IF(COUNTIF(E$6:E521,E522)<1,\"初\",IFERROR(VLOOKUP(INDEX(F$1:F521,_xlfn.AGGREGATE(14,6,ROW(E$6:E521)/(E$6:E521=E522),1)),{\"申\",\"　\";\"　\",\"申\"},2,0),\"\")))","v":""},null,null,null,null,null,null,null,null," "]
[null,{"$f":"IF(C523<>1,\"\",1+INDEX(B:B,MATCH(MAX(B$1:B522)+1,B$1:B522, 1)))","v":""},{"$f":"IF(D523=\"\",\"\",IF(D523<D522,IF(1+INDEX(C:C,MATCH(MAX(C$1:C522)+1,C$1:C522, 1))>12,1,1+INDEX(C:C,MATCH(MAX(C$1:C522)+1,C$1:C522, 1))),\"\"))","v":""},null,null,{"$f":"IF(E523=\"\",\"\",IF(COUNTIF(E$6:E522,E523)<1,\"初\",IFERROR(VLOOKUP(INDEX(F$1:F522,_xlfn.AGGREGATE(14,6,ROW(E$6:E522)/(E$6:E522=E523),1)),{\"申\",\"　\";\"　\",\"申\"},2,0),\"\")))","v":""},null,null,null,null,null,null,null,null," "]
[null,{"$f":"IF(C524<>1,\"\",1+INDEX(B:B,MATCH(MAX(B$1:B523)+1,B$1:B523, 1)))","v":""},{"$f":"IF(D524=\"\",\"\",IF(D524<D523,IF(1+INDEX(C:C,MATCH(MAX(C$1:C523)+1,C$1:C523, 1))>12,1,1+INDEX(C:C,MATCH(MAX(C$1:C523)+1,C$1:C523, 1))),\"\"))","v":""},null,null,{"$f":"IF(E524=\"\",\"\",IF(COUNTIF(E$6:E523,E524)<1,\"初\",IFERROR(VLOOKUP(INDEX(F$1:F523,_xlfn.AGGREGATE(14,6,ROW(E$6:E523)/(E$6:E523=E524),1)),{\"申\",\"　\";\"　\",\"申\"},2,0),\"\")))","v":""},null,null,null,null,null,null,null,null," "]
[null,{"$f":"IF(C525<>1,\"\",1+INDEX(B:B,MATCH(MAX(B$1:B524)+1,B$1:B524, 1)))","v":""},{"$f":"IF(D525=\"\",\"\",IF(D525<D524,IF(1+INDEX(C:C,MATCH(MAX(C$1:C524)+1,C$1:C524, 1))>12,1,1+INDEX(C:C,MATCH(MAX(C$1:C524)+1,C$1:C524, 1))),\"\"))","v":""},null,null,{"$f":"IF(E525=\"\",\"\",IF(COUNTIF(E$6:E524,E525)<1,\"初\",IFERROR(VLOOKUP(INDEX(F$1:F524,_xlfn.AGGREGATE(14,6,ROW(E$6:E524)/(E$6:E524=E525),1)),{\"申\",\"　\";\"　\",\"申\"},2,0),\"\")))","v":""},null,null,null,null,null,null,null,null," "]
[null,{"$f":"IF(C526<>1,\"\",1+INDEX(B:B,MATCH(MAX(B$1:B525)+1,B$1:B525, 1)))","v":""},{"$f":"IF(D526=\"\",\"\",IF(D526<D525,IF(1+INDEX(C:C,MATCH(MAX(C$1:C525)+1,C$1:C525, 1))>12,1,1+INDEX(C:C,MATCH(MAX(C$1:C525)+1,C$1:C525, 1))),\"\"))","v":""},null,null,{"$f":"IF(E526=\"\",\"\",IF(COUNTIF(E$6:E525,E526)<1,\"初\",IFERROR(VLOOKUP(INDEX(F$1:F525,_xlfn.AGGREGATE(14,6,ROW(E$6:E525)/(E$6:E525=E526),1)),{\"申\",\"　\";\"　\",\"申\"},2,0),\"\")))","v":""},null,null,null,null,null,null,null,null," "]
[null,{"$f":"IF(C527<>1,\"\",1+INDEX(B:B,MATCH(MAX(B$1:B526)+1,B$1:B526, 1)))","v":""},{"$f":"IF(D527=\"\",\"\",IF(D527<D526,IF(1+INDEX(C:C,MATCH(MAX(C$1:C526)+1,C$1:C526, 1))>12,1,1+INDEX(C:C,MATCH(MAX(C$1:C526)+1,C$1:C526, 1))),\"\"))","v":""},null,null,{"$f":"IF(E527=\"\",\"\",IF(COUNTIF(E$6:E526,E527)<1,\"初\",IFERROR(VLOOKUP(INDEX(F$1:F526,_xlfn.AGGREGATE(14,6,ROW(E$6:E526)/(E$6:E526=E527),1)),{\"申\",\"　\";\"　\",\"申\"},2,0),\"\")))","v":""},null,null,null,null,null,null,null,null," "]
[null,{"$f":"IF(C528<>1,\"\",1+INDEX(B:B,MATCH(MAX(B$1:B527)+1,B$1:B527, 1)))","v":""},{"$f":"IF(D528=\"\",\"\",IF(D528<D527,IF(1+INDEX(C:C,MATCH(MAX(C$1:C527)+1,C$1:C527, 1))>12,1,1+INDEX(C:C,MATCH(MAX(C$1:C527)+1,C$1:C527, 1))),\"\"))","v":""},null,null,{"$f":"IF(E528=\"\",\"\",IF(COUNTIF(E$6:E527,E528)<1,\"初\",IFERROR(VLOOKUP(INDEX(F$1:F527,_xlfn.AGGREGATE(14,6,ROW(E$6:E527)/(E$6:E527=E528),1)),{\"申\",\"　\";\"　\",\"申\"},2,0),\"\")))","v":""},null,null,null,null,null,null,null,null," "]
[null,{"$f":"IF(C529<>1,\"\",1+INDEX(B:B,MATCH(MAX(B$1:B528)+1,B$1:B528, 1)))","v":""},{"$f":"IF(D529=\"\",\"\",IF(D529<D528,IF(1+INDEX(C:C,MATCH(MAX(C$1:C528)+1,C$1:C528, 1))>12,1,1+INDEX(C:C,MATCH(MAX(C$1:C528)+1,C$1:C528, 1))),\"\"))","v":""},null,null,{"$f":"IF(E529=\"\",\"\",IF(COUNTIF(E$6:E528,E529)<1,\"初\",IFERROR(VLOOKUP(INDEX(F$1:F528,_xlfn.AGGREGATE(14,6,ROW(E$6:E528)/(E$6:E528=E529),1)),{\"申\",\"　\";\"　\",\"申\"},2,0),\"\")))","v":""},null,null,null,null,null,null,null,null," "]
[null,{"$f":"IF(C530<>1,\"\",1+INDEX(B:B,MATCH(MAX(B$1:B529)+1,B$1:B529, 1)))","v":""},{"$f":"IF(D530=\"\",\"\",IF(D530<D529,IF(1+INDEX(C:C,MATCH(MAX(C$1:C529)+1,C$1:C529, 1))>12,1,1+INDEX(C:C,MATCH(MAX(C$1:C529)+1,C$1:C529, 1))),\"\"))","v":""},null,null,{"$f":"IF(E530=\"\",\"\",IF(COUNTIF(E$6:E529,E530)<1,\"初\",IFERROR(VLOOKUP(INDEX(F$1:F529,_xlfn.AGGREGATE(14,6,ROW(E$6:E529)/(E$6:E529=E530),1)),{\"申\",\"　\";\"　\",\"申\"},2,0),\"\")))","v":""},null,null,null,null,null,null,null,null," "]
[null,{"$f":"IF(C531<>1,\"\",1+INDEX(B:B,MATCH(MAX(B$1:B530)+1,B$1:B530, 1)))","v":""},{"$f":"IF(D531=\"\",\"\",IF(D531<D530,IF(1+INDEX(C:C,MATCH(MAX(C$1:C530)+1,C$1:C530, 1))>12,1,1+INDEX(C:C,MATCH(MAX(C$1:C530)+1,C$1:C530, 1))),\"\"))","v":""},null,null,{"$f":"IF(E531=\"\",\"\",IF(COUNTIF(E$6:E530,E531)<1,\"初\",IFERROR(VLOOKUP(INDEX(F$1:F530,_xlfn.AGGREGATE(14,6,ROW(E$6:E530)/(E$6:E530=E531),1)),{\"申\",\"　\";\"　\",\"申\"},2,0),\"\")))","v":""},null,null,null,null,null,null,null,null," "]
[null,{"$f":"IF(C532<>1,\"\",1+INDEX(B:B,MATCH(MAX(B$1:B531)+1,B$1:B531, 1)))","v":""},{"$f":"IF(D532=\"\",\"\",IF(D532<D531,IF(1+INDEX(C:C,MATCH(MAX(C$1:C531)+1,C$1:C531, 1))>12,1,1+INDEX(C:C,MATCH(MAX(C$1:C531)+1,C$1:C531, 1))),\"\"))","v":""},null,null,{"$f":"IF(E532=\"\",\"\",IF(COUNTIF(E$6:E531,E532)<1,\"初\",IFERROR(VLOOKUP(INDEX(F$1:F531,_xlfn.AGGREGATE(14,6,ROW(E$6:E531)/(E$6:E531=E532),1)),{\"申\",\"　\";\"　\",\"申\"},2,0),\"\")))","v":""},null,null,null,null,null,null,null,null," "]
[null,{"$f":"IF(C533<>1,\"\",1+INDEX(B:B,MATCH(MAX(B$1:B532)+1,B$1:B532, 1)))","v":""},{"$f":"IF(D533=\"\",\"\",IF(D533<D532,IF(1+INDEX(C:C,MATCH(MAX(C$1:C532)+1,C$1:C532, 1))>12,1,1+INDEX(C:C,MATCH(MAX(C$1:C532)+1,C$1:C532, 1))),\"\"))","v":""},null,null,{"$f":"IF(E533=\"\",\"\",IF(COUNTIF(E$6:E532,E533)<1,\"初\",IFERROR(VLOOKUP(INDEX(F$1:F532,_xlfn.AGGREGATE(14,6,ROW(E$6:E532)/(E$6:E532=E533),1)),{\"申\",\"　\";\"　\",\"申\"},2,0),\"\")))","v":""},null,null,null,null,null,null,null,null," "]
[null,{"$f":"IF(C534<>1,\"\",1+INDEX(B:B,MATCH(MAX(B$1:B533)+1,B$1:B533, 1)))","v":""},{"$f":"IF(D534=\"\",\"\",IF(D534<D533,IF(1+INDEX(C:C,MATCH(MAX(C$1:C533)+1,C$1:C533, 1))>12,1,1+INDEX(C:C,MATCH(MAX(C$1:C533)+1,C$1:C533, 1))),\"\"))","v":""},null,null,{"$f":"IF(E534=\"\",\"\",IF(COUNTIF(E$6:E533,E534)<1,\"初\",IFERROR(VLOOKUP(INDEX(F$1:F533,_xlfn.AGGREGATE(14,6,ROW(E$6:E533)/(E$6:E533=E534),1)),{\"申\",\"　\";\"　\",\"申\"},2,0),\"\")))","v":""},null,null,null,null,null,null,null,null," "]
[null,{"$f":"IF(C535<>1,\"\",1+INDEX(B:B,MATCH(MAX(B$1:B534)+1,B$1:B534, 1)))","v":""},{"$f":"IF(D535=\"\",\"\",IF(D535<D534,IF(1+INDEX(C:C,MATCH(MAX(C$1:C534)+1,C$1:C534, 1))>12,1,1+INDEX(C:C,MATCH(MAX(C$1:C534)+1,C$1:C534, 1))),\"\"))","v":""},null,null,{"$f":"IF(E535=\"\",\"\",IF(COUNTIF(E$6:E534,E535)<1,\"初\",IFERROR(VLOOKUP(INDEX(F$1:F534,_xlfn.AGGREGATE(14,6,ROW(E$6:E534)/(E$6:E534=E535),1)),{\"申\",\"　\";\"　\",\"申\"},2,0),\"\")))","v":""},null,null,null,null,null,null,null,null," "]
[null,{"$f":"IF(C536<>1,\"\",1+INDEX(B:B,MATCH(MAX(B$1:B535)+1,B$1:B535, 1)))","v":""},{"$f":"IF(D536=\"\",\"\",IF(D536<D535,IF(1+INDEX(C:C,MATCH(MAX(C$1:C535)+1,C$1:C535, 1))>12,1,1+INDEX(C:C,MATCH(MAX(C$1:C535)+1,C$1:C535, 1))),\"\"))","v":""},null,null,{"$f":"IF(E536=\"\",\"\",IF(COUNTIF(E$6:E535,E536)<1,\"初\",IFERROR(VLOOKUP(INDEX(F$1:F535,_xlfn.AGGREGATE(14,6,ROW(E$6:E535)/(E$6:E535=E536),1)),{\"申\",\"　\";\"　\",\"申\"},2,0),\"\")))","v":""},null,null,null,null,null,null,null,null," "]
[null,{"$f":"IF(C537<>1,\"\",1+INDEX(B:B,MATCH(MAX(B$1:B536)+1,B$1:B536, 1)))","v":""},{"$f":"IF(D537=\"\",\"\",IF(D537<D536,IF(1+INDEX(C:C,MATCH(MAX(C$1:C536)+1,C$1:C536, 1))>12,1,1+INDEX(C:C,MATCH(MAX(C$1:C536)+1,C$1:C536, 1))),\"\"))","v":""},null,null,{"$f":"IF(E537=\"\",\"\",IF(COUNTIF(E$6:E536,E537)<1,\"初\",IFERROR(VLOOKUP(INDEX(F$1:F536,_xlfn.AGGREGATE(14,6,ROW(E$6:E536)/(E$6:E536=E537),1)),{\"申\",\"　\";\"　\",\"申\"},2,0),\"\")))","v":""},null,null,null,null,null,null,null,null," "]
[null,{"$f":"IF(C538<>1,\"\",1+INDEX(B:B,MATCH(MAX(B$1:B537)+1,B$1:B537, 1)))","v":""},{"$f":"IF(D538=\"\",\"\",IF(D538<D537,IF(1+INDEX(C:C,MATCH(MAX(C$1:C537)+1,C$1:C537, 1))>12,1,1+INDEX(C:C,MATCH(MAX(C$1:C537)+1,C$1:C537, 1))),\"\"))","v":""},null,null,{"$f":"IF(E538=\"\",\"\",IF(COUNTIF(E$6:E537,E538)<1,\"初\",IFERROR(VLOOKUP(INDEX(F$1:F537,_xlfn.AGGREGATE(14,6,ROW(E$6:E537)/(E$6:E537=E538),1)),{\"申\",\"　\";\"　\",\"申\"},2,0),\"\")))","v":""},null,null,null,null,null,null,null,null," "]
[null,{"$f":"IF(C539<>1,\"\",1+INDEX(B:B,MATCH(MAX(B$1:B538)+1,B$1:B538, 1)))","v":""},{"$f":"IF(D539=\"\",\"\",IF(D539<D538,IF(1+INDEX(C:C,MATCH(MAX(C$1:C538)+1,C$1:C538, 1))>12,1,1+INDEX(C:C,MATCH(MAX(C$1:C538)+1,C$1:C538, 1))),\"\"))","v":""},null,null,{"$f":"IF(E539=\"\",\"\",IF(COUNTIF(E$6:E538,E539)<1,\"初\",IFERROR(VLOOKUP(INDEX(F$1:F538,_xlfn.AGGREGATE(14,6,ROW(E$6:E538)/(E$6:E538=E539),1)),{\"申\",\"　\";\"　\",\"申\"},2,0),\"\")))","v":""},null,null,null,null,null,null,null,null," "]
[null,{"$f":"IF(C540<>1,\"\",1+INDEX(B:B,MATCH(MAX(B$1:B539)+1,B$1:B539, 1)))","v":""},{"$f":"IF(D540=\"\",\"\",IF(D540<D539,IF(1+INDEX(C:C,MATCH(MAX(C$1:C539)+1,C$1:C539, 1))>12,1,1+INDEX(C:C,MATCH(MAX(C$1:C539)+1,C$1:C539, 1))),\"\"))","v":""},null,null,{"$f":"IF(E540=\"\",\"\",IF(COUNTIF(E$6:E539,E540)<1,\"初\",IFERROR(VLOOKUP(INDEX(F$1:F539,_xlfn.AGGREGATE(14,6,ROW(E$6:E539)/(E$6:E539=E540),1)),{\"申\",\"　\";\"　\",\"申\"},2,0),\"\")))","v":""},null,null,null,null,null,null,null,null," "]
[null,{"$f":"IF(C541<>1,\"\",1+INDEX(B:B,MATCH(MAX(B$1:B540)+1,B$1:B540, 1)))","v":""},{"$f":"IF(D541=\"\",\"\",IF(D541<D540,IF(1+INDEX(C:C,MATCH(MAX(C$1:C540)+1,C$1:C540, 1))>12,1,1+INDEX(C:C,MATCH(MAX(C$1:C540)+1,C$1:C540, 1))),\"\"))","v":""},null,null,{"$f":"IF(E541=\"\",\"\",IF(COUNTIF(E$6:E540,E541)<1,\"初\",IFERROR(VLOOKUP(INDEX(F$1:F540,_xlfn.AGGREGATE(14,6,ROW(E$6:E540)/(E$6:E540=E541),1)),{\"申\",\"　\";\"　\",\"申\"},2,0),\"\")))","v":""},null,null,null,null,null,null,null,null," "]
[null,{"$f":"IF(C542<>1,\"\",1+INDEX(B:B,MATCH(MAX(B$1:B541)+1,B$1:B541, 1)))","v":""},{"$f":"IF(D542=\"\",\"\",IF(D542<D541,IF(1+INDEX(C:C,MATCH(MAX(C$1:C541)+1,C$1:C541, 1))>12,1,1+INDEX(C:C,MATCH(MAX(C$1:C541)+1,C$1:C541, 1))),\"\"))","v":""},null,null,{"$f":"IF(E542=\"\",\"\",IF(COUNTIF(E$6:E541,E542)<1,\"初\",IFERROR(VLOOKUP(INDEX(F$1:F541,_xlfn.AGGREGATE(14,6,ROW(E$6:E541)/(E$6:E541=E542),1)),{\"申\",\"　\";\"　\",\"申\"},2,0),\"\")))","v":""},null,null,null,null,null,null,null,null," "]
[null,{"$f":"IF(C543<>1,\"\",1+INDEX(B:B,MATCH(MAX(B$1:B542)+1,B$1:B542, 1)))","v":""},{"$f":"IF(D543=\"\",\"\",IF(D543<D542,IF(1+INDEX(C:C,MATCH(MAX(C$1:C542)+1,C$1:C542, 1))>12,1,1+INDEX(C:C,MATCH(MAX(C$1:C542)+1,C$1:C542, 1))),\"\"))","v":""},null,null,{"$f":"IF(E543=\"\",\"\",IF(COUNTIF(E$6:E542,E543)<1,\"初\",IFERROR(VLOOKUP(INDEX(F$1:F542,_xlfn.AGGREGATE(14,6,ROW(E$6:E542)/(E$6:E542=E543),1)),{\"申\",\"　\";\"　\",\"申\"},2,0),\"\")))","v":""},null,null,null,null,null,null,null,null,{"$f":"IF(ISERROR(LEFT(E543,FIND(\"　\",E543,1)-1)&\" \"&LEFT(G543,FIND(\"　\",G543,1)-1)&\" \"&K543&L543&\" \"&H543&IF(I543<>\"\",\"or\"&I543,\"\")&J543&M543&N543), \"\", LEFT(E543,FIND(\"　\",E543,1)-1)&\" \"&LEFT(G543,FIND(\"　\",G543,1)-1)&\" \"&K543&L543&\" \"&H543&IF(I543<>\"\",\"or\"&I543,\"\")&J543&M543&N543)&\" \"&F543","v":" "}]
[null,{"$f":"IF(C544<>1,\"\",1+INDEX(B:B,MATCH(MAX(B$1:B543)+1,B$1:B543, 1)))","v":""},{"$f":"IF(D544=\"\",\"\",IF(D544<D543,IF(1+INDEX(C:C,MATCH(MAX(C$1:C543)+1,C$1:C543, 1))>12,1,1+INDEX(C:C,MATCH(MAX(C$1:C543)+1,C$1:C543, 1))),\"\"))","v":""},null,null,{"$f":"IF(E544=\"\",\"\",IF(COUNTIF(E$6:E543,E544)<1,\"初\",IFERROR(VLOOKUP(INDEX(F$1:F543,_xlfn.AGGREGATE(14,6,ROW(E$6:E543)/(E$6:E543=E544),1)),{\"申\",\"　\";\"　\",\"申\"},2,0),\"\")))","v":""},null,null,null,null,null,null,null,null," "]
[null,{"$f":"IF(C545<>1,\"\",1+INDEX(B:B,MATCH(MAX(B$1:B544)+1,B$1:B544, 1)))","v":""},{"$f":"IF(D545=\"\",\"\",IF(D545<D544,IF(1+INDEX(C:C,MATCH(MAX(C$1:C544)+1,C$1:C544, 1))>12,1,1+INDEX(C:C,MATCH(MAX(C$1:C544)+1,C$1:C544, 1))),\"\"))","v":""},null,null,{"$f":"IF(E545=\"\",\"\",IF(COUNTIF(E$6:E544,E545)<1,\"初\",IFERROR(VLOOKUP(INDEX(F$1:F544,_xlfn.AGGREGATE(14,6,ROW(E$6:E544)/(E$6:E544=E545),1)),{\"申\",\"　\";\"　\",\"申\"},2,0),\"\")))","v":""},null,null,null,null,null,null,null,null," "]
[null,{"$f":"IF(C546<>1,\"\",1+INDEX(B:B,MATCH(MAX(B$1:B545)+1,B$1:B545, 1)))","v":""},{"$f":"IF(D546=\"\",\"\",IF(D546<D545,IF(1+INDEX(C:C,MATCH(MAX(C$1:C545)+1,C$1:C545, 1))>12,1,1+INDEX(C:C,MATCH(MAX(C$1:C545)+1,C$1:C545, 1))),\"\"))","v":""},null,null,{"$f":"IF(E546=\"\",\"\",IF(COUNTIF(E$6:E545,E546)<1,\"初\",IFERROR(VLOOKUP(INDEX(F$1:F545,_xlfn.AGGREGATE(14,6,ROW(E$6:E545)/(E$6:E545=E546),1)),{\"申\",\"　\";\"　\",\"申\"},2,0),\"\")))","v":""},null,null,null,null,null,null,null,null," "]
[null,{"$f":"IF(C547<>1,\"\",1+INDEX(B:B,MATCH(MAX(B$1:B546)+1,B$1:B546, 1)))","v":""},{"$f":"IF(D547=\"\",\"\",IF(D547<D546,IF(1+INDEX(C:C,MATCH(MAX(C$1:C546)+1,C$1:C546, 1))>12,1,1+INDEX(C:C,MATCH(MAX(C$1:C546)+1,C$1:C546, 1))),\"\"))","v":""},null,null,{"$f":"IF(E547=\"\",\"\",IF(COUNTIF(E$6:E546,E547)<1,\"初\",IFERROR(VLOOKUP(INDEX(F$1:F546,_xlfn.AGGREGATE(14,6,ROW(E$6:E546)/(E$6:E546=E547),1)),{\"申\",\"　\";\"　\",\"申\"},2,0),\"\")))","v":""},null,null,null,null,null,null,null,null," "]
[null,{"$f":"IF(C548<>1,\"\",1+INDEX(B:B,MATCH(MAX(B$1:B547)+1,B$1:B547, 1)))","v":""},{"$f":"IF(D548=\"\",\"\",IF(D548<D547,IF(1+INDEX(C:C,MATCH(MAX(C$1:C547)+1,C$1:C547, 1))>12,1,1+INDEX(C:C,MATCH(MAX(C$1:C547)+1,C$1:C547, 1))),\"\"))","v":""},null,null,{"$f":"IF(E548=\"\",\"\",IF(COUNTIF(E$6:E547,E548)<1,\"初\",IFERROR(VLOOKUP(INDEX(F$1:F547,_xlfn.AGGREGATE(14,6,ROW(E$6:E547)/(E$6:E547=E548),1)),{\"申\",\"　\";\"　\",\"申\"},2,0),\"\")))","v":""},null,null,null,null,null,null,null,null," "]
[null,{"$f":"IF(C549<>1,\"\",1+INDEX(B:B,MATCH(MAX(B$1:B548)+1,B$1:B548, 1)))","v":""},{"$f":"IF(D549=\"\",\"\",IF(D549<D548,IF(1+INDEX(C:C,MATCH(MAX(C$1:C548)+1,C$1:C548, 1))>12,1,1+INDEX(C:C,MATCH(MAX(C$1:C548)+1,C$1:C548, 1))),\"\"))","v":""},null,null,{"$f":"IF(E549=\"\",\"\",IF(COUNTIF(E$6:E548,E549)<1,\"初\",IFERROR(VLOOKUP(INDEX(F$1:F548,_xlfn.AGGREGATE(14,6,ROW(E$6:E548)/(E$6:E548=E549),1)),{\"申\",\"　\";\"　\",\"申\"},2,0),\"\")))","v":""},null,null,null,null,null,null,null,null," "]
[null,{"$f":"IF(C550<>1,\"\",1+INDEX(B:B,MATCH(MAX(B$1:B549)+1,B$1:B549, 1)))","v":""},{"$f":"IF(D550=\"\",\"\",IF(D550<D549,IF(1+INDEX(C:C,MATCH(MAX(C$1:C549)+1,C$1:C549, 1))>12,1,1+INDEX(C:C,MATCH(MAX(C$1:C549)+1,C$1:C549, 1))),\"\"))","v":""},null,null,{"$f":"IF(E550=\"\",\"\",IF(COUNTIF(E$6:E549,E550)<1,\"初\",IFERROR(VLOOKUP(INDEX(F$1:F549,_xlfn.AGGREGATE(14,6,ROW(E$6:E549)/(E$6:E549=E550),1)),{\"申\",\"　\";\"　\",\"申\"},2,0),\"\")))","v":""},null,null,null,null,null,null,null,null," "]
[null,{"$f":"IF(C551<>1,\"\",1+INDEX(B:B,MATCH(MAX(B$1:B550)+1,B$1:B550, 1)))","v":""},{"$f":"IF(D551=\"\",\"\",IF(D551<D550,IF(1+INDEX(C:C,MATCH(MAX(C$1:C550)+1,C$1:C550, 1))>12,1,1+INDEX(C:C,MATCH(MAX(C$1:C550)+1,C$1:C550, 1))),\"\"))","v":""},null,null,{"$f":"IF(E551=\"\",\"\",IF(COUNTIF(E$6:E550,E551)<1,\"初\",IFERROR(VLOOKUP(INDEX(F$1:F550,_xlfn.AGGREGATE(14,6,ROW(E$6:E550)/(E$6:E550=E551),1)),{\"申\",\"　\";\"　\",\"申\"},2,0),\"\")))","v":""},null,null,null,null,null,null,null,null," "]
[null,{"$f":"IF(C552<>1,\"\",1+INDEX(B:B,MATCH(MAX(B$1:B551)+1,B$1:B551, 1)))","v":""},{"$f":"IF(D552=\"\",\"\",IF(D552<D551,IF(1+INDEX(C:C,MATCH(MAX(C$1:C551)+1,C$1:C551, 1))>12,1,1+INDEX(C:C,MATCH(MAX(C$1:C551)+1,C$1:C551, 1))),\"\"))","v":""},null,null,{"$f":"IF(E552=\"\",\"\",IF(COUNTIF(E$6:E551,E552)<1,\"初\",IFERROR(VLOOKUP(INDEX(F$1:F551,_xlfn.AGGREGATE(14,6,ROW(E$6:E551)/(E$6:E551=E552),1)),{\"申\",\"　\";\"　\",\"申\"},2,0),\"\")))","v":""},null,null,null,null,null,null,null,null," "]
[null,{"$f":"IF(C553<>1,\"\",1+INDEX(B:B,MATCH(MAX(B$1:B552)+1,B$1:B552, 1)))","v":""},{"$f":"IF(D553=\"\",\"\",IF(D553<D552,IF(1+INDEX(C:C,MATCH(MAX(C$1:C552)+1,C$1:C552, 1))>12,1,1+INDEX(C:C,MATCH(MAX(C$1:C552)+1,C$1:C552, 1))),\"\"))","v":""},null,null,{"$f":"IF(E553=\"\",\"\",IF(COUNTIF(E$6:E552,E553)<1,\"初\",IFERROR(VLOOKUP(INDEX(F$1:F552,_xlfn.AGGREGATE(14,6,ROW(E$6:E552)/(E$6:E552=E553),1)),{\"申\",\"　\";\"　\",\"申\"},2,0),\"\")))","v":""},null,null,null,null,null,null,null,null," "]
[null,{"$f":"IF(C554<>1,\"\",1+INDEX(B:B,MATCH(MAX(B$1:B553)+1,B$1:B553, 1)))","v":""},{"$f":"IF(D554=\"\",\"\",IF(D554<D553,IF(1+INDEX(C:C,MATCH(MAX(C$1:C553)+1,C$1:C553, 1))>12,1,1+INDEX(C:C,MATCH(MAX(C$1:C553)+1,C$1:C553, 1))),\"\"))","v":""},null,null,{"$f":"IF(E554=\"\",\"\",IF(COUNTIF(E$6:E553,E554)<1,\"初\",IFERROR(VLOOKUP(INDEX(F$1:F553,_xlfn.AGGREGATE(14,6,ROW(E$6:E553)/(E$6:E553=E554),1)),{\"申\",\"　\";\"　\",\"申\"},2,0),\"\")))","v":""},null,null,null,null,null,null,null,null," "]
[null,{"$f":"IF(C555<>1,\"\",1+INDEX(B:B,MATCH(MAX(B$1:B554)+1,B$1:B554, 1)))","v":""},{"$f":"IF(D555=\"\",\"\",IF(D555<D554,IF(1+INDEX(C:C,MATCH(MAX(C$1:C554)+1,C$1:C554, 1))>12,1,1+INDEX(C:C,MATCH(MAX(C$1:C554)+1,C$1:C554, 1))),\"\"))","v":""},null,null,{"$f":"IF(E555=\"\",\"\",IF(COUNTIF(E$6:E554,E555)<1,\"初\",IFERROR(VLOOKUP(INDEX(F$1:F554,_xlfn.AGGREGATE(14,6,ROW(E$6:E554)/(E$6:E554=E555),1)),{\"申\",\"　\";\"　\",\"申\"},2,0),\"\")))","v":""},null,null,null,null,null,null,null,null," "]
[null,{"$f":"IF(C556<>1,\"\",1+INDEX(B:B,MATCH(MAX(B$1:B555)+1,B$1:B555, 1)))","v":""},{"$f":"IF(D556=\"\",\"\",IF(D556<D555,IF(1+INDEX(C:C,MATCH(MAX(C$1:C555)+1,C$1:C555, 1))>12,1,1+INDEX(C:C,MATCH(MAX(C$1:C555)+1,C$1:C555, 1))),\"\"))","v":""},null,null,{"$f":"IF(E556=\"\",\"\",IF(COUNTIF(E$6:E555,E556)<1,\"初\",IFERROR(VLOOKUP(INDEX(F$1:F555,_xlfn.AGGREGATE(14,6,ROW(E$6:E555)/(E$6:E555=E556),1)),{\"申\",\"　\";\"　\",\"申\"},2,0),\"\")))","v":""},null,null,null,null,null,null,null,null," "]
[null,{"$f":"IF(C557<>1,\"\",1+INDEX(B:B,MATCH(MAX(B$1:B556)+1,B$1:B556, 1)))","v":""},{"$f":"IF(D557=\"\",\"\",IF(D557<D556,IF(1+INDEX(C:C,MATCH(MAX(C$1:C556)+1,C$1:C556, 1))>12,1,1+INDEX(C:C,MATCH(MAX(C$1:C556)+1,C$1:C556, 1))),\"\"))","v":""},null,null,{"$f":"IF(E557=\"\",\"\",IF(COUNTIF(E$6:E556,E557)<1,\"初\",IFERROR(VLOOKUP(INDEX(F$1:F556,_xlfn.AGGREGATE(14,6,ROW(E$6:E556)/(E$6:E556=E557),1)),{\"申\",\"　\";\"　\",\"申\"},2,0),\"\")))","v":""},null,null,null,null,null,null,null,null," "]
[null,{"$f":"IF(C558<>1,\"\",1+INDEX(B:B,MATCH(MAX(B$1:B557)+1,B$1:B557, 1)))","v":""},{"$f":"IF(D558=\"\",\"\",IF(D558<D557,IF(1+INDEX(C:C,MATCH(MAX(C$1:C557)+1,C$1:C557, 1))>12,1,1+INDEX(C:C,MATCH(MAX(C$1:C557)+1,C$1:C557, 1))),\"\"))","v":""},null,null,{"$f":"IF(E558=\"\",\"\",IF(COUNTIF(E$6:E557,E558)<1,\"初\",IFERROR(VLOOKUP(INDEX(F$1:F557,_xlfn.AGGREGATE(14,6,ROW(E$6:E557)/(E$6:E557=E558),1)),{\"申\",\"　\";\"　\",\"申\"},2,0),\"\")))","v":""},null,null,null,null,null,null,null,null," "]
[null,{"$f":"IF(C559<>1,\"\",1+INDEX(B:B,MATCH(MAX(B$1:B558)+1,B$1:B558, 1)))","v":""},{"$f":"IF(D559=\"\",\"\",IF(D559<D558,IF(1+INDEX(C:C,MATCH(MAX(C$1:C558)+1,C$1:C558, 1))>12,1,1+INDEX(C:C,MATCH(MAX(C$1:C558)+1,C$1:C558, 1))),\"\"))","v":""},null,null,{"$f":"IF(E559=\"\",\"\",IF(COUNTIF(E$6:E558,E559)<1,\"初\",IFERROR(VLOOKUP(INDEX(F$1:F558,_xlfn.AGGREGATE(14,6,ROW(E$6:E558)/(E$6:E558=E559),1)),{\"申\",\"　\";\"　\",\"申\"},2,0),\"\")))","v":""},null,null,null,null,null,null,null,null," "]
[null,{"$f":"IF(C560<>1,\"\",1+INDEX(B:B,MATCH(MAX(B$1:B559)+1,B$1:B559, 1)))","v":""},{"$f":"IF(D560=\"\",\"\",IF(D560<D559,IF(1+INDEX(C:C,MATCH(MAX(C$1:C559)+1,C$1:C559, 1))>12,1,1+INDEX(C:C,MATCH(MAX(C$1:C559)+1,C$1:C559, 1))),\"\"))","v":""},null,null,{"$f":"IF(E560=\"\",\"\",IF(COUNTIF(E$6:E559,E560)<1,\"初\",IFERROR(VLOOKUP(INDEX(F$1:F559,_xlfn.AGGREGATE(14,6,ROW(E$6:E559)/(E$6:E559=E560),1)),{\"申\",\"　\";\"　\",\"申\"},2,0),\"\")))","v":""},null,null,null,null,null,null,null,null," "]
[null,{"$f":"IF(C561<>1,\"\",1+INDEX(B:B,MATCH(MAX(B$1:B560)+1,B$1:B560, 1)))","v":""},{"$f":"IF(D561=\"\",\"\",IF(D561<D560,IF(1+INDEX(C:C,MATCH(MAX(C$1:C560)+1,C$1:C560, 1))>12,1,1+INDEX(C:C,MATCH(MAX(C$1:C560)+1,C$1:C560, 1))),\"\"))","v":""},null,null,{"$f":"IF(E561=\"\",\"\",IF(COUNTIF(E$6:E560,E561)<1,\"初\",IFERROR(VLOOKUP(INDEX(F$1:F560,_xlfn.AGGREGATE(14,6,ROW(E$6:E560)/(E$6:E560=E561),1)),{\"申\",\"　\";\"　\",\"申\"},2,0),\"\")))","v":""},null,null,null,null,null,null,null,null," "]
[null,{"$f":"IF(C562<>1,\"\",1+INDEX(B:B,MATCH(MAX(B$1:B561)+1,B$1:B561, 1)))","v":""},{"$f":"IF(D562=\"\",\"\",IF(D562<D561,IF(1+INDEX(C:C,MATCH(MAX(C$1:C561)+1,C$1:C561, 1))>12,1,1+INDEX(C:C,MATCH(MAX(C$1:C561)+1,C$1:C561, 1))),\"\"))","v":""},null,null,{"$f":"IF(E562=\"\",\"\",IF(COUNTIF(E$6:E561,E562)<1,\"初\",IFERROR(VLOOKUP(INDEX(F$1:F561,_xlfn.AGGREGATE(14,6,ROW(E$6:E561)/(E$6:E561=E562),1)),{\"申\",\"　\";\"　\",\"申\"},2,0),\"\")))","v":""},null,null,null,null,null,null,null,null," "]
[null,{"$f":"IF(C563<>1,\"\",1+INDEX(B:B,MATCH(MAX(B$1:B562)+1,B$1:B562, 1)))","v":""},{"$f":"IF(D563=\"\",\"\",IF(D563<D562,IF(1+INDEX(C:C,MATCH(MAX(C$1:C562)+1,C$1:C562, 1))>12,1,1+INDEX(C:C,MATCH(MAX(C$1:C562)+1,C$1:C562, 1))),\"\"))","v":""},null,null,{"$f":"IF(E563=\"\",\"\",IF(COUNTIF(E$6:E562,E563)<1,\"初\",IFERROR(VLOOKUP(INDEX(F$1:F562,_xlfn.AGGREGATE(14,6,ROW(E$6:E562)/(E$6:E562=E563),1)),{\"申\",\"　\";\"　\",\"申\"},2,0),\"\")))","v":""},null,null,null,null,null,null,null,null," "]
[null,{"$f":"IF(C564<>1,\"\",1+INDEX(B:B,MATCH(MAX(B$1:B563)+1,B$1:B563, 1)))","v":""},{"$f":"IF(D564=\"\",\"\",IF(D564<D563,IF(1+INDEX(C:C,MATCH(MAX(C$1:C563)+1,C$1:C563, 1))>12,1,1+INDEX(C:C,MATCH(MAX(C$1:C563)+1,C$1:C563, 1))),\"\"))","v":""},null,null,{"$f":"IF(E564=\"\",\"\",IF(COUNTIF(E$6:E563,E564)<1,\"初\",IFERROR(VLOOKUP(INDEX(F$1:F563,_xlfn.AGGREGATE(14,6,ROW(E$6:E563)/(E$6:E563=E564),1)),{\"申\",\"　\";\"　\",\"申\"},2,0),\"\")))","v":""},null,null,null,null,null,null,null,null," "]
[null,{"$f":"IF(C565<>1,\"\",1+INDEX(B:B,MATCH(MAX(B$1:B564)+1,B$1:B564, 1)))","v":""},{"$f":"IF(D565=\"\",\"\",IF(D565<D564,IF(1+INDEX(C:C,MATCH(MAX(C$1:C564)+1,C$1:C564, 1))>12,1,1+INDEX(C:C,MATCH(MAX(C$1:C564)+1,C$1:C564, 1))),\"\"))","v":""},null,null,{"$f":"IF(E565=\"\",\"\",IF(COUNTIF(E$6:E564,E565)<1,\"初\",IFERROR(VLOOKUP(INDEX(F$1:F564,_xlfn.AGGREGATE(14,6,ROW(E$6:E564)/(E$6:E564=E565),1)),{\"申\",\"　\";\"　\",\"申\"},2,0),\"\")))","v":""},null,null,null,null,null,null,null,null," "]
[null,{"$f":"IF(C566<>1,\"\",1+INDEX(B:B,MATCH(MAX(B$1:B565)+1,B$1:B565, 1)))","v":""},{"$f":"IF(D566=\"\",\"\",IF(D566<D565,IF(1+INDEX(C:C,MATCH(MAX(C$1:C565)+1,C$1:C565, 1))>12,1,1+INDEX(C:C,MATCH(MAX(C$1:C565)+1,C$1:C565, 1))),\"\"))","v":""},null,null,{"$f":"IF(E566=\"\",\"\",IF(COUNTIF(E$6:E565,E566)<1,\"初\",IFERROR(VLOOKUP(INDEX(F$1:F565,_xlfn.AGGREGATE(14,6,ROW(E$6:E565)/(E$6:E565=E566),1)),{\"申\",\"　\";\"　\",\"申\"},2,0),\"\")))","v":""},null,null,null,null,null,null,null,null," "]
[null,{"$f":"IF(C567<>1,\"\",1+INDEX(B:B,MATCH(MAX(B$1:B566)+1,B$1:B566, 1)))","v":""},{"$f":"IF(D567=\"\",\"\",IF(D567<D566,IF(1+INDEX(C:C,MATCH(MAX(C$1:C566)+1,C$1:C566, 1))>12,1,1+INDEX(C:C,MATCH(MAX(C$1:C566)+1,C$1:C566, 1))),\"\"))","v":""},null,null,{"$f":"IF(E567=\"\",\"\",IF(COUNTIF(E$6:E566,E567)<1,\"初\",IFERROR(VLOOKUP(INDEX(F$1:F566,_xlfn.AGGREGATE(14,6,ROW(E$6:E566)/(E$6:E566=E567),1)),{\"申\",\"　\";\"　\",\"申\"},2,0),\"\")))","v":""},null,null,null,null,null,null,null,null," "]
[null,{"$f":"IF(C568<>1,\"\",1+INDEX(B:B,MATCH(MAX(B$1:B567)+1,B$1:B567, 1)))","v":""},{"$f":"IF(D568=\"\",\"\",IF(D568<D567,IF(1+INDEX(C:C,MATCH(MAX(C$1:C567)+1,C$1:C567, 1))>12,1,1+INDEX(C:C,MATCH(MAX(C$1:C567)+1,C$1:C567, 1))),\"\"))","v":""},null,null,{"$f":"IF(E568=\"\",\"\",IF(COUNTIF(E$6:E567,E568)<1,\"初\",IFERROR(VLOOKUP(INDEX(F$1:F567,_xlfn.AGGREGATE(14,6,ROW(E$6:E567)/(E$6:E567=E568),1)),{\"申\",\"　\";\"　\",\"申\"},2,0),\"\")))","v":""},null,null,null,null,null,null,null,null," "]
[null,{"$f":"IF(C569<>1,\"\",1+INDEX(B:B,MATCH(MAX(B$1:B568)+1,B$1:B568, 1)))","v":""},{"$f":"IF(D569=\"\",\"\",IF(D569<D568,IF(1+INDEX(C:C,MATCH(MAX(C$1:C568)+1,C$1:C568, 1))>12,1,1+INDEX(C:C,MATCH(MAX(C$1:C568)+1,C$1:C568, 1))),\"\"))","v":""},null,null,{"$f":"IF(E569=\"\",\"\",IF(COUNTIF(E$6:E568,E569)<1,\"初\",IFERROR(VLOOKUP(INDEX(F$1:F568,_xlfn.AGGREGATE(14,6,ROW(E$6:E568)/(E$6:E568=E569),1)),{\"申\",\"　\";\"　\",\"申\"},2,0),\"\")))","v":""},null,null,null,null,null,null,null,null," "]
[null,{"$f":"IF(C570<>1,\"\",1+INDEX(B:B,MATCH(MAX(B$1:B569)+1,B$1:B569, 1)))","v":""},{"$f":"IF(D570=\"\",\"\",IF(D570<D569,IF(1+INDEX(C:C,MATCH(MAX(C$1:C569)+1,C$1:C569, 1))>12,1,1+INDEX(C:C,MATCH(MAX(C$1:C569)+1,C$1:C569, 1))),\"\"))","v":""},null,null,{"$f":"IF(E570=\"\",\"\",IF(COUNTIF(E$6:E569,E570)<1,\"初\",IFERROR(VLOOKUP(INDEX(F$1:F569,_xlfn.AGGREGATE(14,6,ROW(E$6:E569)/(E$6:E569=E570),1)),{\"申\",\"　\";\"　\",\"申\"},2,0),\"\")))","v":""},null,null,null,null,null,null,null,null," "]
[null,{"$f":"IF(C571<>1,\"\",1+INDEX(B:B,MATCH(MAX(B$1:B570)+1,B$1:B570, 1)))","v":""},{"$f":"IF(D571=\"\",\"\",IF(D571<D570,IF(1+INDEX(C:C,MATCH(MAX(C$1:C570)+1,C$1:C570, 1))>12,1,1+INDEX(C:C,MATCH(MAX(C$1:C570)+1,C$1:C570, 1))),\"\"))","v":""},null,null,{"$f":"IF(E571=\"\",\"\",IF(COUNTIF(E$6:E570,E571)<1,\"初\",IFERROR(VLOOKUP(INDEX(F$1:F570,_xlfn.AGGREGATE(14,6,ROW(E$6:E570)/(E$6:E570=E571),1)),{\"申\",\"　\";\"　\",\"申\"},2,0),\"\")))","v":""},null,null,null,null,null,null,null,null," "]
[null,{"$f":"IF(C572<>1,\"\",1+INDEX(B:B,MATCH(MAX(B$1:B571)+1,B$1:B571, 1)))","v":""},{"$f":"IF(D572=\"\",\"\",IF(D572<D571,IF(1+INDEX(C:C,MATCH(MAX(C$1:C571)+1,C$1:C571, 1))>12,1,1+INDEX(C:C,MATCH(MAX(C$1:C571)+1,C$1:C571, 1))),\"\"))","v":""},null,null,{"$f":"IF(E572=\"\",\"\",IF(COUNTIF(E$6:E571,E572)<1,\"初\",IFERROR(VLOOKUP(INDEX(F$1:F571,_xlfn.AGGREGATE(14,6,ROW(E$6:E571)/(E$6:E571=E572),1)),{\"申\",\"　\";\"　\",\"申\"},2,0),\"\")))","v":""},null,null,null,null,null,null,null,null," "]
[null,{"$f":"IF(C573<>1,\"\",1+INDEX(B:B,MATCH(MAX(B$1:B572)+1,B$1:B572, 1)))","v":""},{"$f":"IF(D573=\"\",\"\",IF(D573<D572,IF(1+INDEX(C:C,MATCH(MAX(C$1:C572)+1,C$1:C572, 1))>12,1,1+INDEX(C:C,MATCH(MAX(C$1:C572)+1,C$1:C572, 1))),\"\"))","v":""},null,null,{"$f":"IF(E573=\"\",\"\",IF(COUNTIF(E$6:E572,E573)<1,\"初\",IFERROR(VLOOKUP(INDEX(F$1:F572,_xlfn.AGGREGATE(14,6,ROW(E$6:E572)/(E$6:E572=E573),1)),{\"申\",\"　\";\"　\",\"申\"},2,0),\"\")))","v":""},null,null,null,null,null,null,null,null," "]
[null,{"$f":"IF(C574<>1,\"\",1+INDEX(B:B,MATCH(MAX(B$1:B573)+1,B$1:B573, 1)))","v":""},{"$f":"IF(D574=\"\",\"\",IF(D574<D573,IF(1+INDEX(C:C,MATCH(MAX(C$1:C573)+1,C$1:C573, 1))>12,1,1+INDEX(C:C,MATCH(MAX(C$1:C573)+1,C$1:C573, 1))),\"\"))","v":""},null,null,{"$f":"IF(E574=\"\",\"\",IF(COUNTIF(E$6:E573,E574)<1,\"初\",IFERROR(VLOOKUP(INDEX(F$1:F573,_xlfn.AGGREGATE(14,6,ROW(E$6:E573)/(E$6:E573=E574),1)),{\"申\",\"　\";\"　\",\"申\"},2,0),\"\")))","v":""},null,null,null,null,null,null,null,null," "]
[null,{"$f":"IF(C575<>1,\"\",1+INDEX(B:B,MATCH(MAX(B$1:B574)+1,B$1:B574, 1)))","v":""},{"$f":"IF(D575=\"\",\"\",IF(D575<D574,IF(1+INDEX(C:C,MATCH(MAX(C$1:C574)+1,C$1:C574, 1))>12,1,1+INDEX(C:C,MATCH(MAX(C$1:C574)+1,C$1:C574, 1))),\"\"))","v":""},null,null,{"$f":"IF(E575=\"\",\"\",IF(COUNTIF(E$6:E574,E575)<1,\"初\",IFERROR(VLOOKUP(INDEX(F$1:F574,_xlfn.AGGREGATE(14,6,ROW(E$6:E574)/(E$6:E574=E575),1)),{\"申\",\"　\";\"　\",\"申\"},2,0),\"\")))","v":""},null,null,null,null,null,null,null,null," "]
[null,{"$f":"IF(C576<>1,\"\",1+INDEX(B:B,MATCH(MAX(B$1:B575)+1,B$1:B575, 1)))","v":""},{"$f":"IF(D576=\"\",\"\",IF(D576<D575,IF(1+INDEX(C:C,MATCH(MAX(C$1:C575)+1,C$1:C575, 1))>12,1,1+INDEX(C:C,MATCH(MAX(C$1:C575)+1,C$1:C575, 1))),\"\"))","v":""},null,null,{"$f":"IF(E576=\"\",\"\",IF(COUNTIF(E$6:E575,E576)<1,\"初\",IFERROR(VLOOKUP(INDEX(F$1:F575,_xlfn.AGGREGATE(14,6,ROW(E$6:E575)/(E$6:E575=E576),1)),{\"申\",\"　\";\"　\",\"申\"},2,0),\"\")))","v":""},null,null,null,null,null,null,null,null," "]
[null,{"$f":"IF(C577<>1,\"\",1+INDEX(B:B,MATCH(MAX(B$1:B576)+1,B$1:B576, 1)))","v":""},{"$f":"IF(D577=\"\",\"\",IF(D577<D576,IF(1+INDEX(C:C,MATCH(MAX(C$1:C576)+1,C$1:C576, 1))>12,1,1+INDEX(C:C,MATCH(MAX(C$1:C576)+1,C$1:C576, 1))),\"\"))","v":""},null,null,{"$f":"IF(E577=\"\",\"\",IF(COUNTIF(E$6:E576,E577)<1,\"初\",IFERROR(VLOOKUP(INDEX(F$1:F576,_xlfn.AGGREGATE(14,6,ROW(E$6:E576)/(E$6:E576=E577),1)),{\"申\",\"　\";\"　\",\"申\"},2,0),\"\")))","v":""},null,null,null,null,null,null,null,null," "]
[null,{"$f":"IF(C578<>1,\"\",1+INDEX(B:B,MATCH(MAX(B$1:B577)+1,B$1:B577, 1)))","v":""},{"$f":"IF(D578=\"\",\"\",IF(D578<D577,IF(1+INDEX(C:C,MATCH(MAX(C$1:C577)+1,C$1:C577, 1))>12,1,1+INDEX(C:C,MATCH(MAX(C$1:C577)+1,C$1:C577, 1))),\"\"))","v":""},null,null,{"$f":"IF(E578=\"\",\"\",IF(COUNTIF(E$6:E577,E578)<1,\"初\",IFERROR(VLOOKUP(INDEX(F$1:F577,_xlfn.AGGREGATE(14,6,ROW(E$6:E577)/(E$6:E577=E578),1)),{\"申\",\"　\";\"　\",\"申\"},2,0),\"\")))","v":""},null,null,null,null,null,null,null,null," "]
[null,{"$f":"IF(C579<>1,\"\",1+INDEX(B:B,MATCH(MAX(B$1:B578)+1,B$1:B578, 1)))","v":""},{"$f":"IF(D579=\"\",\"\",IF(D579<D578,IF(1+INDEX(C:C,MATCH(MAX(C$1:C578)+1,C$1:C578, 1))>12,1,1+INDEX(C:C,MATCH(MAX(C$1:C578)+1,C$1:C578, 1))),\"\"))","v":""},null,null,{"$f":"IF(E579=\"\",\"\",IF(COUNTIF(E$6:E578,E579)<1,\"初\",IFERROR(VLOOKUP(INDEX(F$1:F578,_xlfn.AGGREGATE(14,6,ROW(E$6:E578)/(E$6:E578=E579),1)),{\"申\",\"　\";\"　\",\"申\"},2,0),\"\")))","v":""},null,null,null,null,null,null,null,null," "]
[null,{"$f":"IF(C580<>1,\"\",1+INDEX(B:B,MATCH(MAX(B$1:B579)+1,B$1:B579, 1)))","v":""},{"$f":"IF(D580=\"\",\"\",IF(D580<D579,IF(1+INDEX(C:C,MATCH(MAX(C$1:C579)+1,C$1:C579, 1))>12,1,1+INDEX(C:C,MATCH(MAX(C$1:C579)+1,C$1:C579, 1))),\"\"))","v":""},null,null,{"$f":"IF(E580=\"\",\"\",IF(COUNTIF(E$6:E579,E580)<1,\"初\",IFERROR(VLOOKUP(INDEX(F$1:F579,_xlfn.AGGREGATE(14,6,ROW(E$6:E579)/(E$6:E579=E580),1)),{\"申\",\"　\";\"　\",\"申\"},2,0),\"\")))","v":""},null,null,null,null,null,null,null,null," "]
[null,{"$f":"IF(C581<>1,\"\",1+INDEX(B:B,MATCH(MAX(B$1:B580)+1,B$1:B580, 1)))","v":""},{"$f":"IF(D581=\"\",\"\",IF(D581<D580,IF(1+INDEX(C:C,MATCH(MAX(C$1:C580)+1,C$1:C580, 1))>12,1,1+INDEX(C:C,MATCH(MAX(C$1:C580)+1,C$1:C580, 1))),\"\"))","v":""},null,null,{"$f":"IF(E581=\"\",\"\",IF(COUNTIF(E$6:E580,E581)<1,\"初\",IFERROR(VLOOKUP(INDEX(F$1:F580,_xlfn.AGGREGATE(14,6,ROW(E$6:E580)/(E$6:E580=E581),1)),{\"申\",\"　\";\"　\",\"申\"},2,0),\"\")))","v":""},null,null,null,null,null,null,null,null," "]
[null,{"$f":"IF(C582<>1,\"\",1+INDEX(B:B,MATCH(MAX(B$1:B581)+1,B$1:B581, 1)))","v":""},{"$f":"IF(D582=\"\",\"\",IF(D582<D581,IF(1+INDEX(C:C,MATCH(MAX(C$1:C581)+1,C$1:C581, 1))>12,1,1+INDEX(C:C,MATCH(MAX(C$1:C581)+1,C$1:C581, 1))),\"\"))","v":""},null,null,{"$f":"IF(E582=\"\",\"\",IF(COUNTIF(E$6:E581,E582)<1,\"初\",IFERROR(VLOOKUP(INDEX(F$1:F581,_xlfn.AGGREGATE(14,6,ROW(E$6:E581)/(E$6:E581=E582),1)),{\"申\",\"　\";\"　\",\"申\"},2,0),\"\")))","v":""},null,null,null,null,null,null,null,null," "]
[null,{"$f":"IF(C583<>1,\"\",1+INDEX(B:B,MATCH(MAX(B$1:B582)+1,B$1:B582, 1)))","v":""},{"$f":"IF(D583=\"\",\"\",IF(D583<D582,IF(1+INDEX(C:C,MATCH(MAX(C$1:C582)+1,C$1:C582, 1))>12,1,1+INDEX(C:C,MATCH(MAX(C$1:C582)+1,C$1:C582, 1))),\"\"))","v":""},null,null,{"$f":"IF(E583=\"\",\"\",IF(COUNTIF(E$6:E582,E583)<1,\"初\",IFERROR(VLOOKUP(INDEX(F$1:F582,_xlfn.AGGREGATE(14,6,ROW(E$6:E582)/(E$6:E582=E583),1)),{\"申\",\"　\";\"　\",\"申\"},2,0),\"\")))","v":""},null,null,null,null,null,null,null,null," "]
[null,{"$f":"IF(C584<>1,\"\",1+INDEX(B:B,MATCH(MAX(B$1:B583)+1,B$1:B583, 1)))","v":""},{"$f":"IF(D584=\"\",\"\",IF(D584<D583,IF(1+INDEX(C:C,MATCH(MAX(C$1:C583)+1,C$1:C583, 1))>12,1,1+INDEX(C:C,MATCH(MAX(C$1:C583)+1,C$1:C583, 1))),\"\"))","v":""},null,null,{"$f":"IF(E584=\"\",\"\",IF(COUNTIF(E$6:E583,E584)<1,\"初\",IFERROR(VLOOKUP(INDEX(F$1:F583,_xlfn.AGGREGATE(14,6,ROW(E$6:E583)/(E$6:E583=E584),1)),{\"申\",\"　\";\"　\",\"申\"},2,0),\"\")))","v":""},null,null,null,null,null,null,null,null," "]
[null,{"$f":"IF(C585<>1,\"\",1+INDEX(B:B,MATCH(MAX(B$1:B584)+1,B$1:B584, 1)))","v":""},{"$f":"IF(D585=\"\",\"\",IF(D585<D584,IF(1+INDEX(C:C,MATCH(MAX(C$1:C584)+1,C$1:C584, 1))>12,1,1+INDEX(C:C,MATCH(MAX(C$1:C584)+1,C$1:C584, 1))),\"\"))","v":""},null,null,{"$f":"IF(E585=\"\",\"\",IF(COUNTIF(E$6:E584,E585)<1,\"初\",IFERROR(VLOOKUP(INDEX(F$1:F584,_xlfn.AGGREGATE(14,6,ROW(E$6:E584)/(E$6:E584=E585),1)),{\"申\",\"　\";\"　\",\"申\"},2,0),\"\")))","v":""},null,null,null,null,null,null,null,null," "]
[null,{"$f":"IF(C586<>1,\"\",1+INDEX(B:B,MATCH(MAX(B$1:B585)+1,B$1:B585, 1)))","v":""},{"$f":"IF(D586=\"\",\"\",IF(D586<D585,IF(1+INDEX(C:C,MATCH(MAX(C$1:C585)+1,C$1:C585, 1))>12,1,1+INDEX(C:C,MATCH(MAX(C$1:C585)+1,C$1:C585, 1))),\"\"))","v":""},null,null,{"$f":"IF(E586=\"\",\"\",IF(COUNTIF(E$6:E585,E586)<1,\"初\",IFERROR(VLOOKUP(INDEX(F$1:F585,_xlfn.AGGREGATE(14,6,ROW(E$6:E585)/(E$6:E585=E586),1)),{\"申\",\"　\";\"　\",\"申\"},2,0),\"\")))","v":""},null,null,null,null,null,null,null,null," "]
[null,{"$f":"IF(C587<>1,\"\",1+INDEX(B:B,MATCH(MAX(B$1:B586)+1,B$1:B586, 1)))","v":""},{"$f":"IF(D587=\"\",\"\",IF(D587<D586,IF(1+INDEX(C:C,MATCH(MAX(C$1:C586)+1,C$1:C586, 1))>12,1,1+INDEX(C:C,MATCH(MAX(C$1:C586)+1,C$1:C586, 1))),\"\"))","v":""},null,null,{"$f":"IF(E587=\"\",\"\",IF(COUNTIF(E$6:E586,E587)<1,\"初\",IFERROR(VLOOKUP(INDEX(F$1:F586,_xlfn.AGGREGATE(14,6,ROW(E$6:E586)/(E$6:E586=E587),1)),{\"申\",\"　\";\"　\",\"申\"},2,0),\"\")))","v":""},null,null,null,null,null,null,null,null," "]
[null,{"$f":"IF(C588<>1,\"\",1+INDEX(B:B,MATCH(MAX(B$1:B587)+1,B$1:B587, 1)))","v":""},{"$f":"IF(D588=\"\",\"\",IF(D588<D587,IF(1+INDEX(C:C,MATCH(MAX(C$1:C587)+1,C$1:C587, 1))>12,1,1+INDEX(C:C,MATCH(MAX(C$1:C587)+1,C$1:C587, 1))),\"\"))","v":""},null,null,{"$f":"IF(E588=\"\",\"\",IF(COUNTIF(E$6:E587,E588)<1,\"初\",IFERROR(VLOOKUP(INDEX(F$1:F587,_xlfn.AGGREGATE(14,6,ROW(E$6:E587)/(E$6:E587=E588),1)),{\"申\",\"　\";\"　\",\"申\"},2,0),\"\")))","v":""},null,null,null,null,null,null,null,null," "]
[null,{"$f":"IF(C589<>1,\"\",1+INDEX(B:B,MATCH(MAX(B$1:B588)+1,B$1:B588, 1)))","v":""},{"$f":"IF(D589=\"\",\"\",IF(D589<D588,IF(1+INDEX(C:C,MATCH(MAX(C$1:C588)+1,C$1:C588, 1))>12,1,1+INDEX(C:C,MATCH(MAX(C$1:C588)+1,C$1:C588, 1))),\"\"))","v":""},null,null,{"$f":"IF(E589=\"\",\"\",IF(COUNTIF(E$6:E588,E589)<1,\"初\",IFERROR(VLOOKUP(INDEX(F$1:F588,_xlfn.AGGREGATE(14,6,ROW(E$6:E588)/(E$6:E588=E589),1)),{\"申\",\"　\";\"　\",\"申\"},2,0),\"\")))","v":""},null,null,null,null,null,null,null,null," "]
[null,{"$f":"IF(C590<>1,\"\",1+INDEX(B:B,MATCH(MAX(B$1:B589)+1,B$1:B589, 1)))","v":""},{"$f":"IF(D590=\"\",\"\",IF(D590<D589,IF(1+INDEX(C:C,MATCH(MAX(C$1:C589)+1,C$1:C589, 1))>12,1,1+INDEX(C:C,MATCH(MAX(C$1:C589)+1,C$1:C589, 1))),\"\"))","v":""},null,null,{"$f":"IF(E590=\"\",\"\",IF(COUNTIF(E$6:E589,E590)<1,\"初\",IFERROR(VLOOKUP(INDEX(F$1:F589,_xlfn.AGGREGATE(14,6,ROW(E$6:E589)/(E$6:E589=E590),1)),{\"申\",\"　\";\"　\",\"申\"},2,0),\"\")))","v":""},null,null,null,null,null,null,null,null," "]
[null,{"$f":"IF(C591<>1,\"\",1+INDEX(B:B,MATCH(MAX(B$1:B590)+1,B$1:B590, 1)))","v":""},{"$f":"IF(D591=\"\",\"\",IF(D591<D590,IF(1+INDEX(C:C,MATCH(MAX(C$1:C590)+1,C$1:C590, 1))>12,1,1+INDEX(C:C,MATCH(MAX(C$1:C590)+1,C$1:C590, 1))),\"\"))","v":""},null,null,{"$f":"IF(E591=\"\",\"\",IF(COUNTIF(E$6:E590,E591)<1,\"初\",IFERROR(VLOOKUP(INDEX(F$1:F590,_xlfn.AGGREGATE(14,6,ROW(E$6:E590)/(E$6:E590=E591),1)),{\"申\",\"　\";\"　\",\"申\"},2,0),\"\")))","v":""},null,null,null,null,null,null,null,null," "]
[null,{"$f":"IF(C592<>1,\"\",1+INDEX(B:B,MATCH(MAX(B$1:B591)+1,B$1:B591, 1)))","v":""},{"$f":"IF(D592=\"\",\"\",IF(D592<D591,IF(1+INDEX(C:C,MATCH(MAX(C$1:C591)+1,C$1:C591, 1))>12,1,1+INDEX(C:C,MATCH(MAX(C$1:C591)+1,C$1:C591, 1))),\"\"))","v":""},null,null,{"$f":"IF(E592=\"\",\"\",IF(COUNTIF(E$6:E591,E592)<1,\"初\",IFERROR(VLOOKUP(INDEX(F$1:F591,_xlfn.AGGREGATE(14,6,ROW(E$6:E591)/(E$6:E591=E592),1)),{\"申\",\"　\";\"　\",\"申\"},2,0),\"\")))","v":""},null,null,null,null,null,null,null,null," "]
[null,{"$f":"IF(C593<>1,\"\",1+INDEX(B:B,MATCH(MAX(B$1:B592)+1,B$1:B592, 1)))","v":""},{"$f":"IF(D593=\"\",\"\",IF(D593<D592,IF(1+INDEX(C:C,MATCH(MAX(C$1:C592)+1,C$1:C592, 1))>12,1,1+INDEX(C:C,MATCH(MAX(C$1:C592)+1,C$1:C592, 1))),\"\"))","v":""},null,null,{"$f":"IF(E593=\"\",\"\",IF(COUNTIF(E$6:E592,E593)<1,\"初\",IFERROR(VLOOKUP(INDEX(F$1:F592,_xlfn.AGGREGATE(14,6,ROW(E$6:E592)/(E$6:E592=E593),1)),{\"申\",\"　\";\"　\",\"申\"},2,0),\"\")))","v":""},null,null,null,null,null,null,null,null," "]
[null,{"$f":"IF(C594<>1,\"\",1+INDEX(B:B,MATCH(MAX(B$1:B593)+1,B$1:B593, 1)))","v":""},{"$f":"IF(D594=\"\",\"\",IF(D594<D593,IF(1+INDEX(C:C,MATCH(MAX(C$1:C593)+1,C$1:C593, 1))>12,1,1+INDEX(C:C,MATCH(MAX(C$1:C593)+1,C$1:C593, 1))),\"\"))","v":""},null,null,{"$f":"IF(E594=\"\",\"\",IF(COUNTIF(E$6:E593,E594)<1,\"初\",IFERROR(VLOOKUP(INDEX(F$1:F593,_xlfn.AGGREGATE(14,6,ROW(E$6:E593)/(E$6:E593=E594),1)),{\"申\",\"　\";\"　\",\"申\"},2,0),\"\")))","v":""},null,null,null,null,null,null,null,null," "]
[null,{"$f":"IF(C595<>1,\"\",1+INDEX(B:B,MATCH(MAX(B$1:B594)+1,B$1:B594, 1)))","v":""},{"$f":"IF(D595=\"\",\"\",IF(D595<D594,IF(1+INDEX(C:C,MATCH(MAX(C$1:C594)+1,C$1:C594, 1))>12,1,1+INDEX(C:C,MATCH(MAX(C$1:C594)+1,C$1:C594, 1))),\"\"))","v":""},null,null,{"$f":"IF(E595=\"\",\"\",IF(COUNTIF(E$6:E594,E595)<1,\"初\",IFERROR(VLOOKUP(INDEX(F$1:F594,_xlfn.AGGREGATE(14,6,ROW(E$6:E594)/(E$6:E594=E595),1)),{\"申\",\"　\";\"　\",\"申\"},2,0),\"\")))","v":""},null,null,null,null,null,null,null,null," "]
[null,{"$f":"IF(C596<>1,\"\",1+INDEX(B:B,MATCH(MAX(B$1:B595)+1,B$1:B595, 1)))","v":""},{"$f":"IF(D596=\"\",\"\",IF(D596<D595,IF(1+INDEX(C:C,MATCH(MAX(C$1:C595)+1,C$1:C595, 1))>12,1,1+INDEX(C:C,MATCH(MAX(C$1:C595)+1,C$1:C595, 1))),\"\"))","v":""},null,null,{"$f":"IF(E596=\"\",\"\",IF(COUNTIF(E$6:E595,E596)<1,\"初\",IFERROR(VLOOKUP(INDEX(F$1:F595,_xlfn.AGGREGATE(14,6,ROW(E$6:E595)/(E$6:E595=E596),1)),{\"申\",\"　\";\"　\",\"申\"},2,0),\"\")))","v":""},null,null,null,null,null,null,null,null," "]
[null,{"$f":"IF(C597<>1,\"\",1+INDEX(B:B,MATCH(MAX(B$1:B596)+1,B$1:B596, 1)))","v":""},{"$f":"IF(D597=\"\",\"\",IF(D597<D596,IF(1+INDEX(C:C,MATCH(MAX(C$1:C596)+1,C$1:C596, 1))>12,1,1+INDEX(C:C,MATCH(MAX(C$1:C596)+1,C$1:C596, 1))),\"\"))","v":""},null,null,{"$f":"IF(E597=\"\",\"\",IF(COUNTIF(E$6:E596,E597)<1,\"初\",IFERROR(VLOOKUP(INDEX(F$1:F596,_xlfn.AGGREGATE(14,6,ROW(E$6:E596)/(E$6:E596=E597),1)),{\"申\",\"　\";\"　\",\"申\"},2,0),\"\")))","v":""},null,null,null,null,null,null,null,null," "]
[null,{"$f":"IF(C598<>1,\"\",1+INDEX(B:B,MATCH(MAX(B$1:B597)+1,B$1:B597, 1)))","v":""},{"$f":"IF(D598=\"\",\"\",IF(D598<D597,IF(1+INDEX(C:C,MATCH(MAX(C$1:C597)+1,C$1:C597, 1))>12,1,1+INDEX(C:C,MATCH(MAX(C$1:C597)+1,C$1:C597, 1))),\"\"))","v":""},null,null,{"$f":"IF(E598=\"\",\"\",IF(COUNTIF(E$6:E597,E598)<1,\"初\",IFERROR(VLOOKUP(INDEX(F$1:F597,_xlfn.AGGREGATE(14,6,ROW(E$6:E597)/(E$6:E597=E598),1)),{\"申\",\"　\";\"　\",\"申\"},2,0),\"\")))","v":""},null,null,null,null,null,null,null,null," "]
[null,{"$f":"IF(C599<>1,\"\",1+INDEX(B:B,MATCH(MAX(B$1:B598)+1,B$1:B598, 1)))","v":""},{"$f":"IF(D599=\"\",\"\",IF(D599<D598,IF(1+INDEX(C:C,MATCH(MAX(C$1:C598)+1,C$1:C598, 1))>12,1,1+INDEX(C:C,MATCH(MAX(C$1:C598)+1,C$1:C598, 1))),\"\"))","v":""},null,null,{"$f":"IF(E599=\"\",\"\",IF(COUNTIF(E$6:E598,E599)<1,\"初\",IFERROR(VLOOKUP(INDEX(F$1:F598,_xlfn.AGGREGATE(14,6,ROW(E$6:E598)/(E$6:E598=E599),1)),{\"申\",\"　\";\"　\",\"申\"},2,0),\"\")))","v":""},null,null,null,null,null,null,null,null," "]
[null,{"$f":"IF(C600<>1,\"\",1+INDEX(B:B,MATCH(MAX(B$1:B599)+1,B$1:B599, 1)))","v":""},{"$f":"IF(D600=\"\",\"\",IF(D600<D599,IF(1+INDEX(C:C,MATCH(MAX(C$1:C599)+1,C$1:C599, 1))>12,1,1+INDEX(C:C,MATCH(MAX(C$1:C599)+1,C$1:C599, 1))),\"\"))","v":""},null,null,{"$f":"IF(E600=\"\",\"\",IF(COUNTIF(E$6:E599,E600)<1,\"初\",IFERROR(VLOOKUP(INDEX(F$1:F599,_xlfn.AGGREGATE(14,6,ROW(E$6:E599)/(E$6:E599=E600),1)),{\"申\",\"　\";\"　\",\"申\"},2,0),\"\")))","v":""},null,null,null,null,null,null,null,null," "]
[null,{"$f":"IF(C601<>1,\"\",1+INDEX(B:B,MATCH(MAX(B$1:B600)+1,B$1:B600, 1)))","v":""},{"$f":"IF(D601=\"\",\"\",IF(D601<D600,IF(1+INDEX(C:C,MATCH(MAX(C$1:C600)+1,C$1:C600, 1))>12,1,1+INDEX(C:C,MATCH(MAX(C$1:C600)+1,C$1:C600, 1))),\"\"))","v":""},null,null,{"$f":"IF(E601=\"\",\"\",IF(COUNTIF(E$6:E600,E601)<1,\"初\",IFERROR(VLOOKUP(INDEX(F$1:F600,_xlfn.AGGREGATE(14,6,ROW(E$6:E600)/(E$6:E600=E601),1)),{\"申\",\"　\";\"　\",\"申\"},2,0),\"\")))","v":""},null,null,null,null,null,null,null,null," "]
[null,{"$f":"IF(C602<>1,\"\",1+INDEX(B:B,MATCH(MAX(B$1:B601)+1,B$1:B601, 1)))","v":""},{"$f":"IF(D602=\"\",\"\",IF(D602<D601,IF(1+INDEX(C:C,MATCH(MAX(C$1:C601)+1,C$1:C601, 1))>12,1,1+INDEX(C:C,MATCH(MAX(C$1:C601)+1,C$1:C601, 1))),\"\"))","v":""},null,null,{"$f":"IF(E602=\"\",\"\",IF(COUNTIF(E$6:E601,E602)<1,\"初\",IFERROR(VLOOKUP(INDEX(F$1:F601,_xlfn.AGGREGATE(14,6,ROW(E$6:E601)/(E$6:E601=E602),1)),{\"申\",\"　\";\"　\",\"申\"},2,0),\"\")))","v":""},null,null,null,null,null,null,null,null," "]
[null,{"$f":"IF(C603<>1,\"\",1+INDEX(B:B,MATCH(MAX(B$1:B602)+1,B$1:B602, 1)))","v":""},{"$f":"IF(D603=\"\",\"\",IF(D603<D602,IF(1+INDEX(C:C,MATCH(MAX(C$1:C602)+1,C$1:C602, 1))>12,1,1+INDEX(C:C,MATCH(MAX(C$1:C602)+1,C$1:C602, 1))),\"\"))","v":""},null,null,{"$f":"IF(E603=\"\",\"\",IF(COUNTIF(E$6:E602,E603)<1,\"初\",IFERROR(VLOOKUP(INDEX(F$1:F602,_xlfn.AGGREGATE(14,6,ROW(E$6:E602)/(E$6:E602=E603),1)),{\"申\",\"　\";\"　\",\"申\"},2,0),\"\")))","v":""},null,null,null,null,null,null,null,null," "]
[null,{"$f":"IF(C604<>1,\"\",1+INDEX(B:B,MATCH(MAX(B$1:B603)+1,B$1:B603, 1)))","v":""},{"$f":"IF(D604=\"\",\"\",IF(D604<D603,IF(1+INDEX(C:C,MATCH(MAX(C$1:C603)+1,C$1:C603, 1))>12,1,1+INDEX(C:C,MATCH(MAX(C$1:C603)+1,C$1:C603, 1))),\"\"))","v":""},null,null,{"$f":"IF(E604=\"\",\"\",IF(COUNTIF(E$6:E603,E604)<1,\"初\",IFERROR(VLOOKUP(INDEX(F$1:F603,_xlfn.AGGREGATE(14,6,ROW(E$6:E603)/(E$6:E603=E604),1)),{\"申\",\"　\";\"　\",\"申\"},2,0),\"\")))","v":""},null,null,null,null,null,null,null,null," "]
[null,{"$f":"IF(C605<>1,\"\",1+INDEX(B:B,MATCH(MAX(B$1:B604)+1,B$1:B604, 1)))","v":""},{"$f":"IF(D605=\"\",\"\",IF(D605<D604,IF(1+INDEX(C:C,MATCH(MAX(C$1:C604)+1,C$1:C604, 1))>12,1,1+INDEX(C:C,MATCH(MAX(C$1:C604)+1,C$1:C604, 1))),\"\"))","v":""},null,null,{"$f":"IF(E605=\"\",\"\",IF(COUNTIF(E$6:E604,E605)<1,\"初\",IFERROR(VLOOKUP(INDEX(F$1:F604,_xlfn.AGGREGATE(14,6,ROW(E$6:E604)/(E$6:E604=E605),1)),{\"申\",\"　\";\"　\",\"申\"},2,0),\"\")))","v":""},null,null,null,null,null,null,null,null," "]
[null,null,null,null,null,{"$f":"IF(E606=\"\",\"\",IF(COUNTIF(E$6:E605,E606)<1,\"初\",IFERROR(VLOOKUP(INDEX(F$1:F605,_xlfn.AGGREGATE(14,6,ROW(E$6:E605)/(E$6:E605=E606),1)),{\"申\",\"　\";\"　\",\"申\"},2,0),\"\")))","v":""},null,null,null,null,null,null,null,null," "]
[null,null,null,null,null,{"$f":"IF(E607=\"\",\"\",IF(COUNTIF(E$6:E606,E607)<1,\"初\",IFERROR(VLOOKUP(INDEX(F$1:F606,_xlfn.AGGREGATE(14,6,ROW(E$6:E606)/(E$6:E606=E607),1)),{\"申\",\"　\";\"　\",\"申\"},2,0),\"\")))","v":""},null,null,null,null,null,null,null,null,{"$f":"IF(ISERROR(LEFT(E607,FIND(\"　\",E607,1)-1)&\" \"&LEFT(G607,FIND(\"　\",G607,1)-1)&\" \"&K607&L607&\" \"&H607&IF(I607<>\"\",\"or\"&I607,\"\")&J607&M607&N607), \"\", LEFT(E607,FIND(\"　\",E607,1)-1)&\" \"&LEFT(G607,FIND(\"　\",G607,1)-1)&\" \"&K607&L607&\" \"&H607&IF(I607<>\"\",\"or\"&I607,\"\")&J607&M607&N607)&\" \"&F607","v":" "}]
[null,null,null,null,null,{"$f":"IF(E608=\"\",\"\",IF(COUNTIF(E$6:E607,E608)<1,\"初\",IFERROR(VLOOKUP(INDEX(F$1:F607,_xlfn.AGGREGATE(14,6,ROW(E$6:E607)/(E$6:E607=E608),1)),{\"申\",\"　\";\"　\",\"申\"},2,0),\"\")))","v":""},null,null,null,null,null,null,null,null," "]
[null,null,null,null,null,{"$f":"IF(E609=\"\",\"\",IF(COUNTIF(E$6:E608,E609)<1,\"初\",IFERROR(VLOOKUP(INDEX(F$1:F608,_xlfn.AGGREGATE(14,6,ROW(E$6:E608)/(E$6:E608=E609),1)),{\"申\",\"　\";\"　\",\"申\"},2,0),\"\")))","v":""},null,null,null,null,null,null,null,null," "]
[null,null,null,null,null,{"$f":"IF(E610=\"\",\"\",IF(COUNTIF(E$6:E609,E610)<1,\"初\",IFERROR(VLOOKUP(INDEX(F$1:F609,_xlfn.AGGREGATE(14,6,ROW(E$6:E609)/(E$6:E609=E610),1)),{\"申\",\"　\";\"　\",\"申\"},2,0),\"\")))","v":""},null,null,null,null,null,null,null,null," "]
[null,null,null,null,null,{"$f":"IF(E611=\"\",\"\",IF(COUNTIF(E$6:E610,E611)<1,\"初\",IFERROR(VLOOKUP(INDEX(F$1:F610,_xlfn.AGGREGATE(14,6,ROW(E$6:E610)/(E$6:E610=E611),1)),{\"申\",\"　\";\"　\",\"申\"},2,0),\"\")))","v":""},null,null,null,null,null,null,null,null," "]
[null,null,null,null,null,{"$f":"IF(E612=\"\",\"\",IF(COUNTIF(E$6:E611,E612)<1,\"初\",IFERROR(VLOOKUP(INDEX(F$1:F611,_xlfn.AGGREGATE(14,6,ROW(E$6:E611)/(E$6:E611=E612),1)),{\"申\",\"　\";\"　\",\"申\"},2,0),\"\")))","v":""},null,null,null,null,null,null,null,null," "]
[null,null,null,null,null,{"$f":"IF(E613=\"\",\"\",IF(COUNTIF(E$6:E612,E613)<1,\"初\",IFERROR(VLOOKUP(INDEX(F$1:F612,_xlfn.AGGREGATE(14,6,ROW(E$6:E612)/(E$6:E612=E613),1)),{\"申\",\"　\";\"　\",\"申\"},2,0),\"\")))","v":""},null,null,null,null,null,null,null,null," "]
[null,null,null,null,null,{"$f":"IF(E614=\"\",\"\",IF(COUNTIF(E$6:E613,E614)<1,\"初\",IFERROR(VLOOKUP(INDEX(F$1:F613,_xlfn.AGGREGATE(14,6,ROW(E$6:E613)/(E$6:E613=E614),1)),{\"申\",\"　\";\"　\",\"申\"},2,0),\"\")))","v":""},null,null,null,null,null,null,null,null," "]
[null,null,null,null,null,{"$f":"IF(E615=\"\",\"\",IF(COUNTIF(E$6:E614,E615)<1,\"初\",IFERROR(VLOOKUP(INDEX(F$1:F614,_xlfn.AGGREGATE(14,6,ROW(E$6:E614)/(E$6:E614=E615),1)),{\"申\",\"　\";\"　\",\"申\"},2,0),\"\")))","v":""},null,null,null,null,null,null,null,null," "]
[null,null,null,null,null,{"$f":"IF(E616=\"\",\"\",IF(COUNTIF(E$6:E615,E616)<1,\"初\",IFERROR(VLOOKUP(INDEX(F$1:F615,_xlfn.AGGREGATE(14,6,ROW(E$6:E615)/(E$6:E615=E616),1)),{\"申\",\"　\";\"　\",\"申\"},2,0),\"\")))","v":""},null,null,null,null,null,null,null,null," "]
[null,null,null,null,null,{"$f":"IF(E617=\"\",\"\",IF(COUNTIF(E$6:E616,E617)<1,\"初\",IFERROR(VLOOKUP(INDEX(F$1:F616,_xlfn.AGGREGATE(14,6,ROW(E$6:E616)/(E$6:E616=E617),1)),{\"申\",\"　\";\"　\",\"申\"},2,0),\"\")))","v":""},null,null,null,null,null,null,null,null," "]
[null,null,null,null,null,{"$f":"IF(E618=\"\",\"\",IF(COUNTIF(E$6:E617,E618)<1,\"初\",IFERROR(VLOOKUP(INDEX(F$1:F617,_xlfn.AGGREGATE(14,6,ROW(E$6:E617)/(E$6:E617=E618),1)),{\"申\",\"　\";\"　\",\"申\"},2,0),\"\")))","v":""},null,null,null,null,null,null,null,null," "]
[null,null,null,null,null,{"$f":"IF(E619=\"\",\"\",IF(COUNTIF(E$6:E618,E619)<1,\"初\",IFERROR(VLOOKUP(INDEX(F$1:F618,_xlfn.AGGREGATE(14,6,ROW(E$6:E618)/(E$6:E618=E619),1)),{\"申\",\"　\";\"　\",\"申\"},2,0),\"\")))","v":""},null,null,null,null,null,null,null,null," "]
[null,null,null,null,null,{"$f":"IF(E620=\"\",\"\",IF(COUNTIF(E$6:E619,E620)<1,\"初\",IFERROR(VLOOKUP(INDEX(F$1:F619,_xlfn.AGGREGATE(14,6,ROW(E$6:E619)/(E$6:E619=E620),1)),{\"申\",\"　\";\"　\",\"申\"},2,0),\"\")))","v":""},null,null,null,null,null,null,null,null," "]
[null,null,null,null,null,{"$f":"IF(E621=\"\",\"\",IF(COUNTIF(E$6:E620,E621)<1,\"初\",IFERROR(VLOOKUP(INDEX(F$1:F620,_xlfn.AGGREGATE(14,6,ROW(E$6:E620)/(E$6:E620=E621),1)),{\"申\",\"　\";\"　\",\"申\"},2,0),\"\")))","v":""},null,null,null,null,null,null,null,null," "]
[null,null,null,null,null,{"$f":"IF(E622=\"\",\"\",IF(COUNTIF(E$6:E621,E622)<1,\"初\",IFERROR(VLOOKUP(INDEX(F$1:F621,_xlfn.AGGREGATE(14,6,ROW(E$6:E621)/(E$6:E621=E622),1)),{\"申\",\"　\";\"　\",\"申\"},2,0),\"\")))","v":""},null,null,null,null,null,null,null,null," "]
[null,null,null,null,null,{"$f":"IF(E623=\"\",\"\",IF(COUNTIF(E$6:E622,E623)<1,\"初\",IFERROR(VLOOKUP(INDEX(F$1:F622,_xlfn.AGGREGATE(14,6,ROW(E$6:E622)/(E$6:E622=E623),1)),{\"申\",\"　\";\"　\",\"申\"},2,0),\"\")))","v":""},null,null,null,null,null,null,null,null," "]
[null,null,null,null,null,{"$f":"IF(E624=\"\",\"\",IF(COUNTIF(E$6:E623,E624)<1,\"初\",IFERROR(VLOOKUP(INDEX(F$1:F623,_xlfn.AGGREGATE(14,6,ROW(E$6:E623)/(E$6:E623=E624),1)),{\"申\",\"　\";\"　\",\"申\"},2,0),\"\")))","v":""},null,null,null,null,null,null,null,null," "]
[null,null,null,null,null,{"$f":"IF(E625=\"\",\"\",IF(COUNTIF(E$6:E624,E625)<1,\"初\",IFERROR(VLOOKUP(INDEX(F$1:F624,_xlfn.AGGREGATE(14,6,ROW(E$6:E624)/(E$6:E624=E625),1)),{\"申\",\"　\";\"　\",\"申\"},2,0),\"\")))","v":""},null,null,null,null,null,null,null,null," "]
[null,null,null,null,null,{"$f":"IF(E626=\"\",\"\",IF(COUNTIF(E$6:E625,E626)<1,\"初\",IFERROR(VLOOKUP(INDEX(F$1:F625,_xlfn.AGGREGATE(14,6,ROW(E$6:E625)/(E$6:E625=E626),1)),{\"申\",\"　\";\"　\",\"申\"},2,0),\"\")))","v":""},null,null,null,null,null,null,null,null," "]
[null,null,null,null,null,{"$f":"IF(E627=\"\",\"\",IF(COUNTIF(E$6:E626,E627)<1,\"初\",IFERROR(VLOOKUP(INDEX(F$1:F626,_xlfn.AGGREGATE(14,6,ROW(E$6:E626)/(E$6:E626=E627),1)),{\"申\",\"　\";\"　\",\"申\"},2,0),\"\")))","v":""},null,null,null,null,null,null,null,null," "]
[null,null,null,null,null,{"$f":"IF(E628=\"\",\"\",IF(COUNTIF(E$6:E627,E628)<1,\"初\",IFERROR(VLOOKUP(INDEX(F$1:F627,_xlfn.AGGREGATE(14,6,ROW(E$6:E627)/(E$6:E627=E628),1)),{\"申\",\"　\";\"　\",\"申\"},2,0),\"\")))","v":""},null,null,null,null,null,null,null,null," "]
[null,null,null,null,null,{"$f":"IF(E629=\"\",\"\",IF(COUNTIF(E$6:E628,E629)<1,\"初\",IFERROR(VLOOKUP(INDEX(F$1:F628,_xlfn.AGGREGATE(14,6,ROW(E$6:E628)/(E$6:E628=E629),1)),{\"申\",\"　\";\"　\",\"申\"},2,0),\"\")))","v":""},null,null,null,null,null,null,null,null," "]
[null,null,null,null,null,{"$f":"IF(E630=\"\",\"\",IF(COUNTIF(E$6:E629,E630)<1,\"初\",IFERROR(VLOOKUP(INDEX(F$1:F629,_xlfn.AGGREGATE(14,6,ROW(E$6:E629)/(E$6:E629=E630),1)),{\"申\",\"　\";\"　\",\"申\"},2,0),\"\")))","v":""},null,null,null,null,null,null,null,null," "]
[null,null,null,null,null,{"$f":"IF(E631=\"\",\"\",IF(COUNTIF(E$6:E630,E631)<1,\"初\",IFERROR(VLOOKUP(INDEX(F$1:F630,_xlfn.AGGREGATE(14,6,ROW(E$6:E630)/(E$6:E630=E631),1)),{\"申\",\"　\";\"　\",\"申\"},2,0),\"\")))","v":""},null,null,null,null,null,null,null,null," "]
[null,null,null,null,null,{"$f":"IF(E632=\"\",\"\",IF(COUNTIF(E$6:E631,E632)<1,\"初\",IFERROR(VLOOKUP(INDEX(F$1:F631,_xlfn.AGGREGATE(14,6,ROW(E$6:E631)/(E$6:E631=E632),1)),{\"申\",\"　\";\"　\",\"申\"},2,0),\"\")))","v":""},null,null,null,null,null,null,null,null," "]
[null,null,null,null,null,{"$f":"IF(E633=\"\",\"\",IF(COUNTIF(E$6:E632,E633)<1,\"初\",IFERROR(VLOOKUP(INDEX(F$1:F632,_xlfn.AGGREGATE(14,6,ROW(E$6:E632)/(E$6:E632=E633),1)),{\"申\",\"　\";\"　\",\"申\"},2,0),\"\")))","v":""},null,null,null,null,null,null,null,null," "]
[null,null,null,null,null,{"$f":"IF(E634=\"\",\"\",IF(COUNTIF(E$6:E633,E634)<1,\"初\",IFERROR(VLOOKUP(INDEX(F$1:F633,_xlfn.AGGREGATE(14,6,ROW(E$6:E633)/(E$6:E633=E634),1)),{\"申\",\"　\";\"　\",\"申\"},2,0),\"\")))","v":""},null,null,null,null,null,null,null,null," "]
[null,null,null,null,null,{"$f":"IF(E635=\"\",\"\",IF(COUNTIF(E$6:E634,E635)<1,\"初\",IFERROR(VLOOKUP(INDEX(F$1:F634,_xlfn.AGGREGATE(14,6,ROW(E$6:E634)/(E$6:E634=E635),1)),{\"申\",\"　\";\"　\",\"申\"},2,0),\"\")))","v":""},null,null,null,null,null,null,null,null," "]
[null,null,null,null,null,{"$f":"IF(E636=\"\",\"\",IF(COUNTIF(E$6:E635,E636)<1,\"初\",IFERROR(VLOOKUP(INDEX(F$1:F635,_xlfn.AGGREGATE(14,6,ROW(E$6:E635)/(E$6:E635=E636),1)),{\"申\",\"　\";\"　\",\"申\"},2,0),\"\")))","v":""},null,null,null,null,null,null,null,null," "]
[null,null,null,null,null,{"$f":"IF(E637=\"\",\"\",IF(COUNTIF(E$6:E636,E637)<1,\"初\",IFERROR(VLOOKUP(INDEX(F$1:F636,_xlfn.AGGREGATE(14,6,ROW(E$6:E636)/(E$6:E636=E637),1)),{\"申\",\"　\";\"　\",\"申\"},2,0),\"\")))","v":""},null,null,null,null,null,null,null,null," "]
[null,null,null,null,null,{"$f":"IF(E638=\"\",\"\",IF(COUNTIF(E$6:E637,E638)<1,\"初\",IFERROR(VLOOKUP(INDEX(F$1:F637,_xlfn.AGGREGATE(14,6,ROW(E$6:E637)/(E$6:E637=E638),1)),{\"申\",\"　\";\"　\",\"申\"},2,0),\"\")))","v":""},null,null,null,null,null,null,null,null," "]
[null,null,null,null,null,{"$f":"IF(E639=\"\",\"\",IF(COUNTIF(E$6:E638,E639)<1,\"初\",IFERROR(VLOOKUP(INDEX(F$1:F638,_xlfn.AGGREGATE(14,6,ROW(E$6:E638)/(E$6:E638=E639),1)),{\"申\",\"　\";\"　\",\"申\"},2,0),\"\")))","v":""},null,null,null,null,null,null,null,null," "]
[null,null,null,null,null,{"$f":"IF(E640=\"\",\"\",IF(COUNTIF(E$6:E639,E640)<1,\"初\",IFERROR(VLOOKUP(INDEX(F$1:F639,_xlfn.AGGREGATE(14,6,ROW(E$6:E639)/(E$6:E639=E640),1)),{\"申\",\"　\";\"　\",\"申\"},2,0),\"\")))","v":""},null,null,null,null,null,null,null,null," "]
[null,null,null,null,null,{"$f":"IF(E641=\"\",\"\",IF(COUNTIF(E$6:E640,E641)<1,\"初\",IFERROR(VLOOKUP(INDEX(F$1:F640,_xlfn.AGGREGATE(14,6,ROW(E$6:E640)/(E$6:E640=E641),1)),{\"申\",\"　\";\"　\",\"申\"},2,0),\"\")))","v":""},null,null,null,null,null,null,null,null," "]
[null,null,null,null,null,{"$f":"IF(E642=\"\",\"\",IF(COUNTIF(E$6:E641,E642)<1,\"初\",IFERROR(VLOOKUP(INDEX(F$1:F641,_xlfn.AGGREGATE(14,6,ROW(E$6:E641)/(E$6:E641=E642),1)),{\"申\",\"　\";\"　\",\"申\"},2,0),\"\")))","v":""},null,null,null,null,null,null,null,null," "]
[null,null,null,null,null,{"$f":"IF(E643=\"\",\"\",IF(COUNTIF(E$6:E642,E643)<1,\"初\",IFERROR(VLOOKUP(INDEX(F$1:F642,_xlfn.AGGREGATE(14,6,ROW(E$6:E642)/(E$6:E642=E643),1)),{\"申\",\"　\";\"　\",\"申\"},2,0),\"\")))","v":""},null,null,null,null,null,null,null,null," "]
[null,null,null,null,null,{"$f":"IF(E644=\"\",\"\",IF(COUNTIF(E$6:E643,E644)<1,\"初\",IFERROR(VLOOKUP(INDEX(F$1:F643,_xlfn.AGGREGATE(14,6,ROW(E$6:E643)/(E$6:E643=E644),1)),{\"申\",\"　\";\"　\",\"申\"},2,0),\"\")))","v":""},null,null,null,null,null,null,null,null," "]
[null,null,null,null,null,{"$f":"IF(E645=\"\",\"\",IF(COUNTIF(E$6:E644,E645)<1,\"初\",IFERROR(VLOOKUP(INDEX(F$1:F644,_xlfn.AGGREGATE(14,6,ROW(E$6:E644)/(E$6:E644=E645),1)),{\"申\",\"　\";\"　\",\"申\"},2,0),\"\")))","v":""},null,null,null,null,null,null,null,null," "]
[null,null,null,null,null,{"$f":"IF(E646=\"\",\"\",IF(COUNTIF(E$6:E645,E646)<1,\"初\",IFERROR(VLOOKUP(INDEX(F$1:F645,_xlfn.AGGREGATE(14,6,ROW(E$6:E645)/(E$6:E645=E646),1)),{\"申\",\"　\";\"　\",\"申\"},2,0),\"\")))","v":""},null,null,null,null,null,null,null,null," "]
[null,null,null,null,null,{"$f":"IF(E647=\"\",\"\",IF(COUNTIF(E$6:E646,E647)<1,\"初\",IFERROR(VLOOKUP(INDEX(F$1:F646,_xlfn.AGGREGATE(14,6,ROW(E$6:E646)/(E$6:E646=E647),1)),{\"申\",\"　\";\"　\",\"申\"},2,0),\"\")))","v":""},null,null,null,null,null,null,null,null," "]
[null,null,null,null,null,{"$f":"IF(E648=\"\",\"\",IF(COUNTIF(E$6:E647,E648)<1,\"初\",IFERROR(VLOOKUP(INDEX(F$1:F647,_xlfn.AGGREGATE(14,6,ROW(E$6:E647)/(E$6:E647=E648),1)),{\"申\",\"　\";\"　\",\"申\"},2,0),\"\")))","v":""},null,null,null,null,null,null,null,null," "]
[null,null,null,null,null,{"$f":"IF(E649=\"\",\"\",IF(COUNTIF(E$6:E648,E649)<1,\"初\",IFERROR(VLOOKUP(INDEX(F$1:F648,_xlfn.AGGREGATE(14,6,ROW(E$6:E648)/(E$6:E648=E649),1)),{\"申\",\"　\";\"　\",\"申\"},2,0),\"\")))","v":""},null,null,null,null,null,null,null,null," "]
[null,null,null,null,null,{"$f":"IF(E650=\"\",\"\",IF(COUNTIF(E$6:E649,E650)<1,\"初\",IFERROR(VLOOKUP(INDEX(F$1:F649,_xlfn.AGGREGATE(14,6,ROW(E$6:E649)/(E$6:E649=E650),1)),{\"申\",\"　\";\"　\",\"申\"},2,0),\"\")))","v":""},null,null,null,null,null,null,null,null," "]
[null,null,null,null,null,{"$f":"IF(E651=\"\",\"\",IF(COUNTIF(E$6:E650,E651)<1,\"初\",IFERROR(VLOOKUP(INDEX(F$1:F650,_xlfn.AGGREGATE(14,6,ROW(E$6:E650)/(E$6:E650=E651),1)),{\"申\",\"　\";\"　\",\"申\"},2,0),\"\")))","v":""},null,null,null,null,null,null,null,null," "]
[null,null,null,null,null,{"$f":"IF(E652=\"\",\"\",IF(COUNTIF(E$6:E651,E652)<1,\"初\",IFERROR(VLOOKUP(INDEX(F$1:F651,_xlfn.AGGREGATE(14,6,ROW(E$6:E651)/(E$6:E651=E652),1)),{\"申\",\"　\";\"　\",\"申\"},2,0),\"\")))","v":""},null,null,null,null,null,null,null,null," "]
[null,null,null,null,null,{"$f":"IF(E653=\"\",\"\",IF(COUNTIF(E$6:E652,E653)<1,\"初\",IFERROR(VLOOKUP(INDEX(F$1:F652,_xlfn.AGGREGATE(14,6,ROW(E$6:E652)/(E$6:E652=E653),1)),{\"申\",\"　\";\"　\",\"申\"},2,0),\"\")))","v":""},null,null,null,null,null,null,null,null," "]
[null,null,null,null,null,{"$f":"IF(E654=\"\",\"\",IF(COUNTIF(E$6:E653,E654)<1,\"初\",IFERROR(VLOOKUP(INDEX(F$1:F653,_xlfn.AGGREGATE(14,6,ROW(E$6:E653)/(E$6:E653=E654),1)),{\"申\",\"　\";\"　\",\"申\"},2,0),\"\")))","v":""},null,null,null,null,null,null,null,null," "]
[null,null,null,null,null,{"$f":"IF(E655=\"\",\"\",IF(COUNTIF(E$6:E654,E655)<1,\"初\",IFERROR(VLOOKUP(INDEX(F$1:F654,_xlfn.AGGREGATE(14,6,ROW(E$6:E654)/(E$6:E654=E655),1)),{\"申\",\"　\";\"　\",\"申\"},2,0),\"\")))","v":""},null,null,null,null,null,null,null,null," "]
[null,null,null,null,null,{"$f":"IF(E656=\"\",\"\",IF(COUNTIF(E$6:E655,E656)<1,\"初\",IFERROR(VLOOKUP(INDEX(F$1:F655,_xlfn.AGGREGATE(14,6,ROW(E$6:E655)/(E$6:E655=E656),1)),{\"申\",\"　\";\"　\",\"申\"},2,0),\"\")))","v":""},null,null,null,null,null,null,null,null," "]
[null,null,null,null,null,{"$f":"IF(E657=\"\",\"\",IF(COUNTIF(E$6:E656,E657)<1,\"初\",IFERROR(VLOOKUP(INDEX(F$1:F656,_xlfn.AGGREGATE(14,6,ROW(E$6:E656)/(E$6:E656=E657),1)),{\"申\",\"　\";\"　\",\"申\"},2,0),\"\")))","v":""},null,null,null,null,null,null,null,null," "]
[null,null,null,null,null,{"$f":"IF(E658=\"\",\"\",IF(COUNTIF(E$6:E657,E658)<1,\"初\",IFERROR(VLOOKUP(INDEX(F$1:F657,_xlfn.AGGREGATE(14,6,ROW(E$6:E657)/(E$6:E657=E658),1)),{\"申\",\"　\";\"　\",\"申\"},2,0),\"\")))","v":""},null,null,null,null,null,null,null,null," "]
[null,null,null,null,null,{"$f":"IF(E659=\"\",\"\",IF(COUNTIF(E$6:E658,E659)<1,\"初\",IFERROR(VLOOKUP(INDEX(F$1:F658,_xlfn.AGGREGATE(14,6,ROW(E$6:E658)/(E$6:E658=E659),1)),{\"申\",\"　\";\"　\",\"申\"},2,0),\"\")))","v":""},null,null,null,null,null,null,null,null," "]
[null,null,null,null,null,{"$f":"IF(E660=\"\",\"\",IF(COUNTIF(E$6:E659,E660)<1,\"初\",IFERROR(VLOOKUP(INDEX(F$1:F659,_xlfn.AGGREGATE(14,6,ROW(E$6:E659)/(E$6:E659=E660),1)),{\"申\",\"　\";\"　\",\"申\"},2,0),\"\")))","v":""},null,null,null,null,null,null,null,null," "]
[null,null,null,null,null,{"$f":"IF(E661=\"\",\"\",IF(COUNTIF(E$6:E660,E661)<1,\"初\",IFERROR(VLOOKUP(INDEX(F$1:F660,_xlfn.AGGREGATE(14,6,ROW(E$6:E660)/(E$6:E660=E661),1)),{\"申\",\"　\";\"　\",\"申\"},2,0),\"\")))","v":""},null,null,null,null,null,null,null,null," "]
[null,null,null,null,null,{"$f":"IF(E662=\"\",\"\",IF(COUNTIF(E$6:E661,E662)<1,\"初\",IFERROR(VLOOKUP(INDEX(F$1:F661,_xlfn.AGGREGATE(14,6,ROW(E$6:E661)/(E$6:E661=E662),1)),{\"申\",\"　\";\"　\",\"申\"},2,0),\"\")))","v":""},null,null,null,null,null,null,null,null," "]
[null,null,null,null,null,{"$f":"IF(E663=\"\",\"\",IF(COUNTIF(E$6:E662,E663)<1,\"初\",IFERROR(VLOOKUP(INDEX(F$1:F662,_xlfn.AGGREGATE(14,6,ROW(E$6:E662)/(E$6:E662=E663),1)),{\"申\",\"　\";\"　\",\"申\"},2,0),\"\")))","v":""},null,null,null,null,null,null,null,null," "]
[null,null,null,null,null,{"$f":"IF(E664=\"\",\"\",IF(COUNTIF(E$6:E663,E664)<1,\"初\",IFERROR(VLOOKUP(INDEX(F$1:F663,_xlfn.AGGREGATE(14,6,ROW(E$6:E663)/(E$6:E663=E664),1)),{\"申\",\"　\";\"　\",\"申\"},2,0),\"\")))","v":""},null,null,null,null,null,null,null,null," "]
[null,null,null,null,null,{"$f":"IF(E665=\"\",\"\",IF(COUNTIF(E$6:E664,E665)<1,\"初\",IFERROR(VLOOKUP(INDEX(F$1:F664,_xlfn.AGGREGATE(14,6,ROW(E$6:E664)/(E$6:E664=E665),1)),{\"申\",\"　\";\"　\",\"申\"},2,0),\"\")))","v":""},null,null,null,null,null,null,null,null," "]
[null,null,null,null,null,{"$f":"IF(E666=\"\",\"\",IF(COUNTIF(E$6:E665,E666)<1,\"初\",IFERROR(VLOOKUP(INDEX(F$1:F665,_xlfn.AGGREGATE(14,6,ROW(E$6:E665)/(E$6:E665=E666),1)),{\"申\",\"　\";\"　\",\"申\"},2,0),\"\")))","v":""},null,null,null,null,null,null,null,null," "]
[null,null,null,null,null,{"$f":"IF(E667=\"\",\"\",IF(COUNTIF(E$6:E666,E667)<1,\"初\",IFERROR(VLOOKUP(INDEX(F$1:F666,_xlfn.AGGREGATE(14,6,ROW(E$6:E666)/(E$6:E666=E667),1)),{\"申\",\"　\";\"　\",\"申\"},2,0),\"\")))","v":""},null,null,null,null,null,null,null,null," "]
[null,null,null,null,null,{"$f":"IF(E668=\"\",\"\",IF(COUNTIF(E$6:E667,E668)<1,\"初\",IFERROR(VLOOKUP(INDEX(F$1:F667,_xlfn.AGGREGATE(14,6,ROW(E$6:E667)/(E$6:E667=E668),1)),{\"申\",\"　\";\"　\",\"申\"},2,0),\"\")))","v":""},null,null,null,null,null,null,null,null," "]
[null,null,null,null,null,{"$f":"IF(E669=\"\",\"\",IF(COUNTIF(E$6:E668,E669)<1,\"初\",IFERROR(VLOOKUP(INDEX(F$1:F668,_xlfn.AGGREGATE(14,6,ROW(E$6:E668)/(E$6:E668=E669),1)),{\"申\",\"　\";\"　\",\"申\"},2,0),\"\")))","v":""},null,null,null,null,null,null,null,null," "]
[null,null,null,null,null,{"$f":"IF(E670=\"\",\"\",IF(COUNTIF(E$6:E669,E670)<1,\"初\",IFERROR(VLOOKUP(INDEX(F$1:F669,_xlfn.AGGREGATE(14,6,ROW(E$6:E669)/(E$6:E669=E670),1)),{\"申\",\"　\";\"　\",\"申\"},2,0),\"\")))","v":""},null,null,null,null,null,null,null,null," "]
[null,null,null,null,null,{"$f":"IF(E671=\"\",\"\",IF(COUNTIF(E$6:E670,E671)<1,\"初\",IFERROR(VLOOKUP(INDEX(F$1:F670,_xlfn.AGGREGATE(14,6,ROW(E$6:E670)/(E$6:E670=E671),1)),{\"申\",\"　\";\"　\",\"申\"},2,0),\"\")))","v":""},null,null,null,null,null,null,null,null,{"$f":"IF(ISERROR(LEFT(E671,FIND(\"　\",E671,1)-1)&\" \"&LEFT(G671,FIND(\"　\",G671,1)-1)&\" \"&K671&L671&\" \"&H671&IF(I671<>\"\",\"or\"&I671,\"\")&J671&M671&N671), \"\", LEFT(E671,FIND(\"　\",E671,1)-1)&\" \"&LEFT(G671,FIND(\"　\",G671,1)-1)&\" \"&K671&L671&\" \"&H671&IF(I671<>\"\",\"or\"&I671,\"\")&J671&M671&N671)&\" \"&F671","v":" "}]
[null,null,null,null,null,{"$f":"IF(E672=\"\",\"\",IF(COUNTIF(E$6:E671,E672)<1,\"初\",IFERROR(VLOOKUP(INDEX(F$1:F671,_xlfn.AGGREGATE(14,6,ROW(E$6:E671)/(E$6:E671=E672),1)),{\"申\",\"　\";\"　\",\"申\"},2,0),\"\")))","v":""},null,null,null,null,null,null,null,null," "]
[null,null,null,null,null,{"$f":"IF(E673=\"\",\"\",IF(COUNTIF(E$6:E672,E673)<1,\"初\",IFERROR(VLOOKUP(INDEX(F$1:F672,_xlfn.AGGREGATE(14,6,ROW(E$6:E672)/(E$6:E672=E673),1)),{\"申\",\"　\";\"　\",\"申\"},2,0),\"\")))","v":""},null,null,null,null,null,null,null,null," "]
[null,null,null,null,null,{"$f":"IF(E674=\"\",\"\",IF(COUNTIF(E$6:E673,E674)<1,\"初\",IFERROR(VLOOKUP(INDEX(F$1:F673,_xlfn.AGGREGATE(14,6,ROW(E$6:E673)/(E$6:E673=E674),1)),{\"申\",\"　\";\"　\",\"申\"},2,0),\"\")))","v":""},null,null,null,null,null,null,null,null," "]
[null,null,null,null,null,{"$f":"IF(E675=\"\",\"\",IF(COUNTIF(E$6:E674,E675)<1,\"初\",IFERROR(VLOOKUP(INDEX(F$1:F674,_xlfn.AGGREGATE(14,6,ROW(E$6:E674)/(E$6:E674=E675),1)),{\"申\",\"　\";\"　\",\"申\"},2,0),\"\")))","v":""},null,null,null,null,null,null,null,null," "]
[null,null,null,null,null,{"$f":"IF(E676=\"\",\"\",IF(COUNTIF(E$6:E675,E676)<1,\"初\",IFERROR(VLOOKUP(INDEX(F$1:F675,_xlfn.AGGREGATE(14,6,ROW(E$6:E675)/(E$6:E675=E676),1)),{\"申\",\"　\";\"　\",\"申\"},2,0),\"\")))","v":""},null,null,null,null,null,null,null,null," "]
[null,null,null,null,null,{"$f":"IF(E677=\"\",\"\",IF(COUNTIF(E$6:E676,E677)<1,\"初\",IFERROR(VLOOKUP(INDEX(F$1:F676,_xlfn.AGGREGATE(14,6,ROW(E$6:E676)/(E$6:E676=E677),1)),{\"申\",\"　\";\"　\",\"申\"},2,0),\"\")))","v":""},null,null,null,null,null,null,null,null," "]
[null,null,null,null,null,{"$f":"IF(E678=\"\",\"\",IF(COUNTIF(E$6:E677,E678)<1,\"初\",IFERROR(VLOOKUP(INDEX(F$1:F677,_xlfn.AGGREGATE(14,6,ROW(E$6:E677)/(E$6:E677=E678),1)),{\"申\",\"　\";\"　\",\"申\"},2,0),\"\")))","v":""},null,null,null,null,null,null,null,null," "]
[null,null,null,null,null,{"$f":"IF(E679=\"\",\"\",IF(COUNTIF(E$6:E678,E679)<1,\"初\",IFERROR(VLOOKUP(INDEX(F$1:F678,_xlfn.AGGREGATE(14,6,ROW(E$6:E678)/(E$6:E678=E679),1)),{\"申\",\"　\";\"　\",\"申\"},2,0),\"\")))","v":""},null,null,null,null,null,null,null,null," "]
[null,null,null,null,null,{"$f":"IF(E680=\"\",\"\",IF(COUNTIF(E$6:E679,E680)<1,\"初\",IFERROR(VLOOKUP(INDEX(F$1:F679,_xlfn.AGGREGATE(14,6,ROW(E$6:E679)/(E$6:E679=E680),1)),{\"申\",\"　\";\"　\",\"申\"},2,0),\"\")))","v":""},null,null,null,null,null,null,null,null," "]
[null,null,null,null,null,{"$f":"IF(E681=\"\",\"\",IF(COUNTIF(E$6:E680,E681)<1,\"初\",IFERROR(VLOOKUP(INDEX(F$1:F680,_xlfn.AGGREGATE(14,6,ROW(E$6:E680)/(E$6:E680=E681),1)),{\"申\",\"　\";\"　\",\"申\"},2,0),\"\")))","v":""},null,null,null,null,null,null,null,null," "]
[null,null,null,null,null,{"$f":"IF(E682=\"\",\"\",IF(COUNTIF(E$6:E681,E682)<1,\"初\",IFERROR(VLOOKUP(INDEX(F$1:F681,_xlfn.AGGREGATE(14,6,ROW(E$6:E681)/(E$6:E681=E682),1)),{\"申\",\"　\";\"　\",\"申\"},2,0),\"\")))","v":""},null,null,null,null,null,null,null,null," "]
[null,null,null,null,null,{"$f":"IF(E683=\"\",\"\",IF(COUNTIF(E$6:E682,E683)<1,\"初\",IFERROR(VLOOKUP(INDEX(F$1:F682,_xlfn.AGGREGATE(14,6,ROW(E$6:E682)/(E$6:E682=E683),1)),{\"申\",\"　\";\"　\",\"申\"},2,0),\"\")))","v":""},null,null,null,null,null,null,null,null," "]
[null,null,null,null,null,{"$f":"IF(E684=\"\",\"\",IF(COUNTIF(E$6:E683,E684)<1,\"初\",IFERROR(VLOOKUP(INDEX(F$1:F683,_xlfn.AGGREGATE(14,6,ROW(E$6:E683)/(E$6:E683=E684),1)),{\"申\",\"　\";\"　\",\"申\"},2,0),\"\")))","v":""},null,null,null,null,null,null,null,null," "]
[null,null,null,null,null,{"$f":"IF(E685=\"\",\"\",IF(COUNTIF(E$6:E684,E685)<1,\"初\",IFERROR(VLOOKUP(INDEX(F$1:F684,_xlfn.AGGREGATE(14,6,ROW(E$6:E684)/(E$6:E684=E685),1)),{\"申\",\"　\";\"　\",\"申\"},2,0),\"\")))","v":""},null,null,null,null,null,null,null,null," "]
[null,null,null,null,null,{"$f":"IF(E686=\"\",\"\",IF(COUNTIF(E$6:E685,E686)<1,\"初\",IFERROR(VLOOKUP(INDEX(F$1:F685,_xlfn.AGGREGATE(14,6,ROW(E$6:E685)/(E$6:E685=E686),1)),{\"申\",\"　\";\"　\",\"申\"},2,0),\"\")))","v":""},null,null,null,null,null,null,null,null," "]
[null,null,null,null,null,{"$f":"IF(E687=\"\",\"\",IF(COUNTIF(E$6:E686,E687)<1,\"初\",IFERROR(VLOOKUP(INDEX(F$1:F686,_xlfn.AGGREGATE(14,6,ROW(E$6:E686)/(E$6:E686=E687),1)),{\"申\",\"　\";\"　\",\"申\"},2,0),\"\")))","v":""},null,null,null,null,null,null,null,null," "]
[null,null,null,null,null,{"$f":"IF(E688=\"\",\"\",IF(COUNTIF(E$6:E687,E688)<1,\"初\",IFERROR(VLOOKUP(INDEX(F$1:F687,_xlfn.AGGREGATE(14,6,ROW(E$6:E687)/(E$6:E687=E688),1)),{\"申\",\"　\";\"　\",\"申\"},2,0),\"\")))","v":""},null,null,null,null,null,null,null,null," "]
[null,null,null,null,null,{"$f":"IF(E689=\"\",\"\",IF(COUNTIF(E$6:E688,E689)<1,\"初\",IFERROR(VLOOKUP(INDEX(F$1:F688,_xlfn.AGGREGATE(14,6,ROW(E$6:E688)/(E$6:E688=E689),1)),{\"申\",\"　\";\"　\",\"申\"},2,0),\"\")))","v":""},null,null,null,null,null,null,null,null," "]
[null,null,null,null,null,{"$f":"IF(E690=\"\",\"\",IF(COUNTIF(E$6:E689,E690)<1,\"初\",IFERROR(VLOOKUP(INDEX(F$1:F689,_xlfn.AGGREGATE(14,6,ROW(E$6:E689)/(E$6:E689=E690),1)),{\"申\",\"　\";\"　\",\"申\"},2,0),\"\")))","v":""},null,null,null,null,null,null,null,null," "]
[null,null,null,null,null,{"$f":"IF(E691=\"\",\"\",IF(COUNTIF(E$6:E690,E691)<1,\"初\",IFERROR(VLOOKUP(INDEX(F$1:F690,_xlfn.AGGREGATE(14,6,ROW(E$6:E690)/(E$6:E690=E691),1)),{\"申\",\"　\";\"　\",\"申\"},2,0),\"\")))","v":""},null,null,null,null,null,null,null,null," "]
[null,null,null,null,null,{"$f":"IF(E692=\"\",\"\",IF(COUNTIF(E$6:E691,E692)<1,\"初\",IFERROR(VLOOKUP(INDEX(F$1:F691,_xlfn.AGGREGATE(14,6,ROW(E$6:E691)/(E$6:E691=E692),1)),{\"申\",\"　\";\"　\",\"申\"},2,0),\"\")))","v":""},null,null,null,null,null,null,null,null," "]
[null,null,null,null,null,{"$f":"IF(E693=\"\",\"\",IF(COUNTIF(E$6:E692,E693)<1,\"初\",IFERROR(VLOOKUP(INDEX(F$1:F692,_xlfn.AGGREGATE(14,6,ROW(E$6:E692)/(E$6:E692=E693),1)),{\"申\",\"　\";\"　\",\"申\"},2,0),\"\")))","v":""},null,null,null,null,null,null,null,null," "]
[null,null,null,null,null,{"$f":"IF(E694=\"\",\"\",IF(COUNTIF(E$6:E693,E694)<1,\"初\",IFERROR(VLOOKUP(INDEX(F$1:F693,_xlfn.AGGREGATE(14,6,ROW(E$6:E693)/(E$6:E693=E694),1)),{\"申\",\"　\";\"　\",\"申\"},2,0),\"\")))","v":""},null,null,null,null,null,null,null,null," "]
[null,null,null,null,null,{"$f":"IF(E695=\"\",\"\",IF(COUNTIF(E$6:E694,E695)<1,\"初\",IFERROR(VLOOKUP(INDEX(F$1:F694,_xlfn.AGGREGATE(14,6,ROW(E$6:E694)/(E$6:E694=E695),1)),{\"申\",\"　\";\"　\",\"申\"},2,0),\"\")))","v":""},null,null,null,null,null,null,null,null," "]
[null,null,null,null,null,{"$f":"IF(E696=\"\",\"\",IF(COUNTIF(E$6:E695,E696)<1,\"初\",IFERROR(VLOOKUP(INDEX(F$1:F695,_xlfn.AGGREGATE(14,6,ROW(E$6:E695)/(E$6:E695=E696),1)),{\"申\",\"　\";\"　\",\"申\"},2,0),\"\")))","v":""},null,null,null,null,null,null,null,null," "]
[null,null,null,null,null,{"$f":"IF(E697=\"\",\"\",IF(COUNTIF(E$6:E696,E697)<1,\"初\",IFERROR(VLOOKUP(INDEX(F$1:F696,_xlfn.AGGREGATE(14,6,ROW(E$6:E696)/(E$6:E696=E697),1)),{\"申\",\"　\";\"　\",\"申\"},2,0),\"\")))","v":""},null,null,null,null,null,null,null,null," "]
[null,null,null,null,null,{"$f":"IF(E698=\"\",\"\",IF(COUNTIF(E$6:E697,E698)<1,\"初\",IFERROR(VLOOKUP(INDEX(F$1:F697,_xlfn.AGGREGATE(14,6,ROW(E$6:E697)/(E$6:E697=E698),1)),{\"申\",\"　\";\"　\",\"申\"},2,0),\"\")))","v":""},null,null,null,null,null,null,null,null," "]
[null,null,null,null,null,{"$f":"IF(E699=\"\",\"\",IF(COUNTIF(E$6:E698,E699)<1,\"初\",IFERROR(VLOOKUP(INDEX(F$1:F698,_xlfn.AGGREGATE(14,6,ROW(E$6:E698)/(E$6:E698=E699),1)),{\"申\",\"　\";\"　\",\"申\"},2,0),\"\")))","v":""},null,null,null,null,null,null,null,null," "]
[null,null,null,null,null,{"$f":"IF(E700=\"\",\"\",IF(COUNTIF(E$6:E699,E700)<1,\"初\",IFERROR(VLOOKUP(INDEX(F$1:F699,_xlfn.AGGREGATE(14,6,ROW(E$6:E699)/(E$6:E699=E700),1)),{\"申\",\"　\";\"　\",\"申\"},2,0),\"\")))","v":""},null,null,null,null,null,null,null,null," "]
[null,null,null,null,null,{"$f":"IF(E701=\"\",\"\",IF(COUNTIF(E$6:E700,E701)<1,\"初\",IFERROR(VLOOKUP(INDEX(F$1:F700,_xlfn.AGGREGATE(14,6,ROW(E$6:E700)/(E$6:E700=E701),1)),{\"申\",\"　\";\"　\",\"申\"},2,0),\"\")))","v":""},null,null,null,null,null,null,null,null," "]
[null,null,null,null,null,{"$f":"IF(E702=\"\",\"\",IF(COUNTIF(E$6:E701,E702)<1,\"初\",IFERROR(VLOOKUP(INDEX(F$1:F701,_xlfn.AGGREGATE(14,6,ROW(E$6:E701)/(E$6:E701=E702),1)),{\"申\",\"　\";\"　\",\"申\"},2,0),\"\")))","v":""},null,null,null,null,null,null,null,null," "]
[null,null,null,null,null,{"$f":"IF(E703=\"\",\"\",IF(COUNTIF(E$6:E702,E703)<1,\"初\",IFERROR(VLOOKUP(INDEX(F$1:F702,_xlfn.AGGREGATE(14,6,ROW(E$6:E702)/(E$6:E702=E703),1)),{\"申\",\"　\";\"　\",\"申\"},2,0),\"\")))","v":""},null,null,null,null,null,null,null,null," "]
[null,null,null,null,null,{"$f":"IF(E704=\"\",\"\",IF(COUNTIF(E$6:E703,E704)<1,\"初\",IFERROR(VLOOKUP(INDEX(F$1:F703,_xlfn.AGGREGATE(14,6,ROW(E$6:E703)/(E$6:E703=E704),1)),{\"申\",\"　\";\"　\",\"申\"},2,0),\"\")))","v":""},null,null,null,null,null,null,null,null," "]
[null,null,null,null,null,{"$f":"IF(E705=\"\",\"\",IF(COUNTIF(E$6:E704,E705)<1,\"初\",IFERROR(VLOOKUP(INDEX(F$1:F704,_xlfn.AGGREGATE(14,6,ROW(E$6:E704)/(E$6:E704=E705),1)),{\"申\",\"　\";\"　\",\"申\"},2,0),\"\")))","v":""},null,null,null,null,null,null,null,null," "]
[null,null,null,null,null,{"$f":"IF(E706=\"\",\"\",IF(COUNTIF(E$6:E705,E706)<1,\"初\",IFERROR(VLOOKUP(INDEX(F$1:F705,_xlfn.AGGREGATE(14,6,ROW(E$6:E705)/(E$6:E705=E706),1)),{\"申\",\"　\";\"　\",\"申\"},2,0),\"\")))","v":""},null,null,null,null,null,null,null,null," "]
[null,null,null,null,null,{"$f":"IF(E707=\"\",\"\",IF(COUNTIF(E$6:E706,E707)<1,\"初\",IFERROR(VLOOKUP(INDEX(F$1:F706,_xlfn.AGGREGATE(14,6,ROW(E$6:E706)/(E$6:E706=E707),1)),{\"申\",\"　\";\"　\",\"申\"},2,0),\"\")))","v":""},null,null,null,null,null,null,null,null," "]
[null,null,null,null,null,{"$f":"IF(E708=\"\",\"\",IF(COUNTIF(E$6:E707,E708)<1,\"初\",IFERROR(VLOOKUP(INDEX(F$1:F707,_xlfn.AGGREGATE(14,6,ROW(E$6:E707)/(E$6:E707=E708),1)),{\"申\",\"　\";\"　\",\"申\"},2,0),\"\")))","v":""},null,null,null,null,null,null,null,null," "]
[null,null,null,null,null,{"$f":"IF(E709=\"\",\"\",IF(COUNTIF(E$6:E708,E709)<1,\"初\",IFERROR(VLOOKUP(INDEX(F$1:F708,_xlfn.AGGREGATE(14,6,ROW(E$6:E708)/(E$6:E708=E709),1)),{\"申\",\"　\";\"　\",\"申\"},2,0),\"\")))","v":""},null,null,null,null,null,null,null,null," "]
[null,null,null,null,null,{"$f":"IF(E710=\"\",\"\",IF(COUNTIF(E$6:E709,E710)<1,\"初\",IFERROR(VLOOKUP(INDEX(F$1:F709,_xlfn.AGGREGATE(14,6,ROW(E$6:E709)/(E$6:E709=E710),1)),{\"申\",\"　\";\"　\",\"申\"},2,0),\"\")))","v":""},null,null,null,null,null,null,null,null," "]
[null,null,null,null,null,{"$f":"IF(E711=\"\",\"\",IF(COUNTIF(E$6:E710,E711)<1,\"初\",IFERROR(VLOOKUP(INDEX(F$1:F710,_xlfn.AGGREGATE(14,6,ROW(E$6:E710)/(E$6:E710=E711),1)),{\"申\",\"　\";\"　\",\"申\"},2,0),\"\")))","v":""},null,null,null,null,null,null,null,null," "]
[null,null,null,null,null,{"$f":"IF(E712=\"\",\"\",IF(COUNTIF(E$6:E711,E712)<1,\"初\",IFERROR(VLOOKUP(INDEX(F$1:F711,_xlfn.AGGREGATE(14,6,ROW(E$6:E711)/(E$6:E711=E712),1)),{\"申\",\"　\";\"　\",\"申\"},2,0),\"\")))","v":""},null,null,null,null,null,null,null,null," "]
[null,null,null,null,null,{"$f":"IF(E713=\"\",\"\",IF(COUNTIF(E$6:E712,E713)<1,\"初\",IFERROR(VLOOKUP(INDEX(F$1:F712,_xlfn.AGGREGATE(14,6,ROW(E$6:E712)/(E$6:E712=E713),1)),{\"申\",\"　\";\"　\",\"申\"},2,0),\"\")))","v":""},null,null,null,null,null,null,null,null," "]
[null,null,null,null,null,{"$f":"IF(E714=\"\",\"\",IF(COUNTIF(E$6:E713,E714)<1,\"初\",IFERROR(VLOOKUP(INDEX(F$1:F713,_xlfn.AGGREGATE(14,6,ROW(E$6:E713)/(E$6:E713=E714),1)),{\"申\",\"　\";\"　\",\"申\"},2,0),\"\")))","v":""},null,null,null,null,null,null,null,null," "]
[null,null,null,null,null,{"$f":"IF(E715=\"\",\"\",IF(COUNTIF(E$6:E714,E715)<1,\"初\",IFERROR(VLOOKUP(INDEX(F$1:F714,_xlfn.AGGREGATE(14,6,ROW(E$6:E714)/(E$6:E714=E715),1)),{\"申\",\"　\";\"　\",\"申\"},2,0),\"\")))","v":""},null,null,null,null,null,null,null,null," "]
[null,null,null,null,null,{"$f":"IF(E716=\"\",\"\",IF(COUNTIF(E$6:E715,E716)<1,\"初\",IFERROR(VLOOKUP(INDEX(F$1:F715,_xlfn.AGGREGATE(14,6,ROW(E$6:E715)/(E$6:E715=E716),1)),{\"申\",\"　\";\"　\",\"申\"},2,0),\"\")))","v":""},null,null,null,null,null,null,null,null," "]
[null,null,null,null,null,{"$f":"IF(E717=\"\",\"\",IF(COUNTIF(E$6:E716,E717)<1,\"初\",IFERROR(VLOOKUP(INDEX(F$1:F716,_xlfn.AGGREGATE(14,6,ROW(E$6:E716)/(E$6:E716=E717),1)),{\"申\",\"　\";\"　\",\"申\"},2,0),\"\")))","v":""},null,null,null,null,null,null,null,null," "]
[null,null,null,null,null,{"$f":"IF(E718=\"\",\"\",IF(COUNTIF(E$6:E717,E718)<1,\"初\",IFERROR(VLOOKUP(INDEX(F$1:F717,_xlfn.AGGREGATE(14,6,ROW(E$6:E717)/(E$6:E717=E718),1)),{\"申\",\"　\";\"　\",\"申\"},2,0),\"\")))","v":""},null,null,null,null,null,null,null,null," "]
[null,null,null,null,null,{"$f":"IF(E719=\"\",\"\",IF(COUNTIF(E$6:E718,E719)<1,\"初\",IFERROR(VLOOKUP(INDEX(F$1:F718,_xlfn.AGGREGATE(14,6,ROW(E$6:E718)/(E$6:E718=E719),1)),{\"申\",\"　\";\"　\",\"申\"},2,0),\"\")))","v":""},null,null,null,null,null,null,null,null," "]
[null,null,null,null,null,{"$f":"IF(E720=\"\",\"\",IF(COUNTIF(E$6:E719,E720)<1,\"初\",IFERROR(VLOOKUP(INDEX(F$1:F719,_xlfn.AGGREGATE(14,6,ROW(E$6:E719)/(E$6:E719=E720),1)),{\"申\",\"　\";\"　\",\"申\"},2,0),\"\")))","v":""},null,null,null,null,null,null,null,null," "]
[null,null,null,null,null,{"$f":"IF(E721=\"\",\"\",IF(COUNTIF(E$6:E720,E721)<1,\"初\",IFERROR(VLOOKUP(INDEX(F$1:F720,_xlfn.AGGREGATE(14,6,ROW(E$6:E720)/(E$6:E720=E721),1)),{\"申\",\"　\";\"　\",\"申\"},2,0),\"\")))","v":""},null,null,null,null,null,null,null,null," "]
[null,null,null,null,null,{"$f":"IF(E722=\"\",\"\",IF(COUNTIF(E$6:E721,E722)<1,\"初\",IFERROR(VLOOKUP(INDEX(F$1:F721,_xlfn.AGGREGATE(14,6,ROW(E$6:E721)/(E$6:E721=E722),1)),{\"申\",\"　\";\"　\",\"申\"},2,0),\"\")))","v":""},null,null,null,null,null,null,null,null," "]
[null,null,null,null,null,{"$f":"IF(E723=\"\",\"\",IF(COUNTIF(E$6:E722,E723)<1,\"初\",IFERROR(VLOOKUP(INDEX(F$1:F722,_xlfn.AGGREGATE(14,6,ROW(E$6:E722)/(E$6:E722=E723),1)),{\"申\",\"　\";\"　\",\"申\"},2,0),\"\")))","v":""},null,null,null,null,null,null,null,null," "]
[null,null,null,null,null,{"$f":"IF(E724=\"\",\"\",IF(COUNTIF(E$6:E723,E724)<1,\"初\",IFERROR(VLOOKUP(INDEX(F$1:F723,_xlfn.AGGREGATE(14,6,ROW(E$6:E723)/(E$6:E723=E724),1)),{\"申\",\"　\";\"　\",\"申\"},2,0),\"\")))","v":""},null,null,null,null,null,null,null,null," "]
[null,null,null,null,null,{"$f":"IF(E725=\"\",\"\",IF(COUNTIF(E$6:E724,E725)<1,\"初\",IFERROR(VLOOKUP(INDEX(F$1:F724,_xlfn.AGGREGATE(14,6,ROW(E$6:E724)/(E$6:E724=E725),1)),{\"申\",\"　\";\"　\",\"申\"},2,0),\"\")))","v":""},null,null,null,null,null,null,null,null," "]
[null,null,null,null,null,{"$f":"IF(E726=\"\",\"\",IF(COUNTIF(E$6:E725,E726)<1,\"初\",IFERROR(VLOOKUP(INDEX(F$1:F725,_xlfn.AGGREGATE(14,6,ROW(E$6:E725)/(E$6:E725=E726),1)),{\"申\",\"　\";\"　\",\"申\"},2,0),\"\")))","v":""},null,null,null,null,null,null,null,null," "]
[null,null,null,null,null,{"$f":"IF(E727=\"\",\"\",IF(COUNTIF(E$6:E726,E727)<1,\"初\",IFERROR(VLOOKUP(INDEX(F$1:F726,_xlfn.AGGREGATE(14,6,ROW(E$6:E726)/(E$6:E726=E727),1)),{\"申\",\"　\";\"　\",\"申\"},2,0),\"\")))","v":""},null,null,null,null,null,null,null,null," "]
[null,null,null,null,null,{"$f":"IF(E728=\"\",\"\",IF(COUNTIF(E$6:E727,E728)<1,\"初\",IFERROR(VLOOKUP(INDEX(F$1:F727,_xlfn.AGGREGATE(14,6,ROW(E$6:E727)/(E$6:E727=E728),1)),{\"申\",\"　\";\"　\",\"申\"},2,0),\"\")))","v":""},null,null,null,null,null,null,null,null," "]
[null,null,null,null,null,{"$f":"IF(E729=\"\",\"\",IF(COUNTIF(E$6:E728,E729)<1,\"初\",IFERROR(VLOOKUP(INDEX(F$1:F728,_xlfn.AGGREGATE(14,6,ROW(E$6:E728)/(E$6:E728=E729),1)),{\"申\",\"　\";\"　\",\"申\"},2,0),\"\")))","v":""},null,null,null,null,null,null,null,null," "]
[null,null,null,null,null,{"$f":"IF(E730=\"\",\"\",IF(COUNTIF(E$6:E729,E730)<1,\"初\",IFERROR(VLOOKUP(INDEX(F$1:F729,_xlfn.AGGREGATE(14,6,ROW(E$6:E729)/(E$6:E729=E730),1)),{\"申\",\"　\";\"　\",\"申\"},2,0),\"\")))","v":""},null,null,null,null,null,null,null,null," "]
[null,null,null,null,null,{"$f":"IF(E731=\"\",\"\",IF(COUNTIF(E$6:E730,E731)<1,\"初\",IFERROR(VLOOKUP(INDEX(F$1:F730,_xlfn.AGGREGATE(14,6,ROW(E$6:E730)/(E$6:E730=E731),1)),{\"申\",\"　\";\"　\",\"申\"},2,0),\"\")))","v":""},null,null,null,null,null,null,null,null," "]
[null,null,null,null,null,{"$f":"IF(E732=\"\",\"\",IF(COUNTIF(E$6:E731,E732)<1,\"初\",IFERROR(VLOOKUP(INDEX(F$1:F731,_xlfn.AGGREGATE(14,6,ROW(E$6:E731)/(E$6:E731=E732),1)),{\"申\",\"　\";\"　\",\"申\"},2,0),\"\")))","v":""},null,null,null,null,null,null,null,null," "]
[null,null,null,null,null,{"$f":"IF(E733=\"\",\"\",IF(COUNTIF(E$6:E732,E733)<1,\"初\",IFERROR(VLOOKUP(INDEX(F$1:F732,_xlfn.AGGREGATE(14,6,ROW(E$6:E732)/(E$6:E732=E733),1)),{\"申\",\"　\";\"　\",\"申\"},2,0),\"\")))","v":""},null,null,null,null,null,null,null,null," "]
[null,null,null,null,null,{"$f":"IF(E734=\"\",\"\",IF(COUNTIF(E$6:E733,E734)<1,\"初\",IFERROR(VLOOKUP(INDEX(F$1:F733,_xlfn.AGGREGATE(14,6,ROW(E$6:E733)/(E$6:E733=E734),1)),{\"申\",\"　\";\"　\",\"申\"},2,0),\"\")))","v":""},null,null,null,null,null,null,null,null," "]
[null,null,null,null,null,{"$f":"IF(E735=\"\",\"\",IF(COUNTIF(E$6:E734,E735)<1,\"初\",IFERROR(VLOOKUP(INDEX(F$1:F734,_xlfn.AGGREGATE(14,6,ROW(E$6:E734)/(E$6:E734=E735),1)),{\"申\",\"　\";\"　\",\"申\"},2,0),\"\")))","v":""},null,null,null,null,null,null,null,null,{"$f":"IF(ISERROR(LEFT(E735,FIND(\"　\",E735,1)-1)&\" \"&LEFT(G735,FIND(\"　\",G735,1)-1)&\" \"&K735&L735&\" \"&H735&IF(I735<>\"\",\"or\"&I735,\"\")&J735&M735&N735), \"\", LEFT(E735,FIND(\"　\",E735,1)-1)&\" \"&LEFT(G735,FIND(\"　\",G735,1)-1)&\" \"&K735&L735&\" \"&H735&IF(I735<>\"\",\"or\"&I735,\"\")&J735&M735&N735)&\" \"&F735","v":" "}]
[null,null,null,null,null,{"$f":"IF(E736=\"\",\"\",IF(COUNTIF(E$6:E735,E736)<1,\"初\",IFERROR(VLOOKUP(INDEX(F$1:F735,_xlfn.AGGREGATE(14,6,ROW(E$6:E735)/(E$6:E735=E736),1)),{\"申\",\"　\";\"　\",\"申\"},2,0),\"\")))","v":""},null,null,null,null,null,null,null,null," "]
[null,null,null,null,null,{"$f":"IF(E737=\"\",\"\",IF(COUNTIF(E$6:E736,E737)<1,\"初\",IFERROR(VLOOKUP(INDEX(F$1:F736,_xlfn.AGGREGATE(14,6,ROW(E$6:E736)/(E$6:E736=E737),1)),{\"申\",\"　\";\"　\",\"申\"},2,0),\"\")))","v":""},null,null,null,null,null,null,null,null," "]
[null,null,null,null,null,{"$f":"IF(E738=\"\",\"\",IF(COUNTIF(E$6:E737,E738)<1,\"初\",IFERROR(VLOOKUP(INDEX(F$1:F737,_xlfn.AGGREGATE(14,6,ROW(E$6:E737)/(E$6:E737=E738),1)),{\"申\",\"　\";\"　\",\"申\"},2,0),\"\")))","v":""},null,null,null,null,null,null,null,null," "]
[null,null,null,null,null,{"$f":"IF(E739=\"\",\"\",IF(COUNTIF(E$6:E738,E739)<1,\"初\",IFERROR(VLOOKUP(INDEX(F$1:F738,_xlfn.AGGREGATE(14,6,ROW(E$6:E738)/(E$6:E738=E739),1)),{\"申\",\"　\";\"　\",\"申\"},2,0),\"\")))","v":""},null,null,null,null,null,null,null,null," "]
[null,null,null,null,null,{"$f":"IF(E740=\"\",\"\",IF(COUNTIF(E$6:E739,E740)<1,\"初\",IFERROR(VLOOKUP(INDEX(F$1:F739,_xlfn.AGGREGATE(14,6,ROW(E$6:E739)/(E$6:E739=E740),1)),{\"申\",\"　\";\"　\",\"申\"},2,0),\"\")))","v":""},null,null,null,null,null,null,null,null," "]
[null,null,null,null,null,{"$f":"IF(E741=\"\",\"\",IF(COUNTIF(E$6:E740,E741)<1,\"初\",IFERROR(VLOOKUP(INDEX(F$1:F740,_xlfn.AGGREGATE(14,6,ROW(E$6:E740)/(E$6:E740=E741),1)),{\"申\",\"　\";\"　\",\"申\"},2,0),\"\")))","v":""},null,null,null,null,null,null,null,null," "]
[null,null,null,null,null,{"$f":"IF(E742=\"\",\"\",IF(COUNTIF(E$6:E741,E742)<1,\"初\",IFERROR(VLOOKUP(INDEX(F$1:F741,_xlfn.AGGREGATE(14,6,ROW(E$6:E741)/(E$6:E741=E742),1)),{\"申\",\"　\";\"　\",\"申\"},2,0),\"\")))","v":""},null,null,null,null,null,null,null,null," "]
[null,null,null,null,null,{"$f":"IF(E743=\"\",\"\",IF(COUNTIF(E$6:E742,E743)<1,\"初\",IFERROR(VLOOKUP(INDEX(F$1:F742,_xlfn.AGGREGATE(14,6,ROW(E$6:E742)/(E$6:E742=E743),1)),{\"申\",\"　\";\"　\",\"申\"},2,0),\"\")))","v":""},null,null,null,null,null,null,null,null," "]
[null,null,null,null,null,{"$f":"IF(E744=\"\",\"\",IF(COUNTIF(E$6:E743,E744)<1,\"初\",IFERROR(VLOOKUP(INDEX(F$1:F743,_xlfn.AGGREGATE(14,6,ROW(E$6:E743)/(E$6:E743=E744),1)),{\"申\",\"　\";\"　\",\"申\"},2,0),\"\")))","v":""},null,null,null,null,null,null,null,null," "]
[null,null,null,null,null,{"$f":"IF(E745=\"\",\"\",IF(COUNTIF(E$6:E744,E745)<1,\"初\",IFERROR(VLOOKUP(INDEX(F$1:F744,_xlfn.AGGREGATE(14,6,ROW(E$6:E744)/(E$6:E744=E745),1)),{\"申\",\"　\";\"　\",\"申\"},2,0),\"\")))","v":""},null,null,null,null,null,null,null,null," "]
[null,null,null,null,null,{"$f":"IF(E746=\"\",\"\",IF(COUNTIF(E$6:E745,E746)<1,\"初\",IFERROR(VLOOKUP(INDEX(F$1:F745,_xlfn.AGGREGATE(14,6,ROW(E$6:E745)/(E$6:E745=E746),1)),{\"申\",\"　\";\"　\",\"申\"},2,0),\"\")))","v":""},null,null,null,null,null,null,null,null," "]
[null,null,null,null,null,{"$f":"IF(E747=\"\",\"\",IF(COUNTIF(E$6:E746,E747)<1,\"初\",IFERROR(VLOOKUP(INDEX(F$1:F746,_xlfn.AGGREGATE(14,6,ROW(E$6:E746)/(E$6:E746=E747),1)),{\"申\",\"　\";\"　\",\"申\"},2,0),\"\")))","v":""},null,null,null,null,null,null,null,null," "]
[null,null,null,null,null,{"$f":"IF(E748=\"\",\"\",IF(COUNTIF(E$6:E747,E748)<1,\"初\",IFERROR(VLOOKUP(INDEX(F$1:F747,_xlfn.AGGREGATE(14,6,ROW(E$6:E747)/(E$6:E747=E748),1)),{\"申\",\"　\";\"　\",\"申\"},2,0),\"\")))","v":""},null,null,null,null,null,null,null,null," "]
[null,null,null,null,null,{"$f":"IF(E749=\"\",\"\",IF(COUNTIF(E$6:E748,E749)<1,\"初\",IFERROR(VLOOKUP(INDEX(F$1:F748,_xlfn.AGGREGATE(14,6,ROW(E$6:E748)/(E$6:E748=E749),1)),{\"申\",\"　\";\"　\",\"申\"},2,0),\"\")))","v":""},null,null,null,null,null,null,null,null," "]
[null,null,null,null,null,{"$f":"IF(E750=\"\",\"\",IF(COUNTIF(E$6:E749,E750)<1,\"初\",IFERROR(VLOOKUP(INDEX(F$1:F749,_xlfn.AGGREGATE(14,6,ROW(E$6:E749)/(E$6:E749=E750),1)),{\"申\",\"　\";\"　\",\"申\"},2,0),\"\")))","v":""},null,null,null,null,null,null,null,null," "]
[null,null,null,null,null,{"$f":"IF(E751=\"\",\"\",IF(COUNTIF(E$6:E750,E751)<1,\"初\",IFERROR(VLOOKUP(INDEX(F$1:F750,_xlfn.AGGREGATE(14,6,ROW(E$6:E750)/(E$6:E750=E751),1)),{\"申\",\"　\";\"　\",\"申\"},2,0),\"\")))","v":""},null,null,null,null,null,null,null,null," "]
[null,null,null,null,null,{"$f":"IF(E752=\"\",\"\",IF(COUNTIF(E$6:E751,E752)<1,\"初\",IFERROR(VLOOKUP(INDEX(F$1:F751,_xlfn.AGGREGATE(14,6,ROW(E$6:E751)/(E$6:E751=E752),1)),{\"申\",\"　\";\"　\",\"申\"},2,0),\"\")))","v":""},null,null,null,null,null,null,null,null," "]
[null,null,null,null,null,{"$f":"IF(E753=\"\",\"\",IF(COUNTIF(E$6:E752,E753)<1,\"初\",IFERROR(VLOOKUP(INDEX(F$1:F752,_xlfn.AGGREGATE(14,6,ROW(E$6:E752)/(E$6:E752=E753),1)),{\"申\",\"　\";\"　\",\"申\"},2,0),\"\")))","v":""},null,null,null,null,null,null,null,null," "]
[null,null,null,null,null,{"$f":"IF(E754=\"\",\"\",IF(COUNTIF(E$6:E753,E754)<1,\"初\",IFERROR(VLOOKUP(INDEX(F$1:F753,_xlfn.AGGREGATE(14,6,ROW(E$6:E753)/(E$6:E753=E754),1)),{\"申\",\"　\";\"　\",\"申\"},2,0),\"\")))","v":""},null,null,null,null,null,null,null,null," "]
[null,null,null,null,null,{"$f":"IF(E755=\"\",\"\",IF(COUNTIF(E$6:E754,E755)<1,\"初\",IFERROR(VLOOKUP(INDEX(F$1:F754,_xlfn.AGGREGATE(14,6,ROW(E$6:E754)/(E$6:E754=E755),1)),{\"申\",\"　\";\"　\",\"申\"},2,0),\"\")))","v":""},null,null,null,null,null,null,null,null," "]
[null,null,null,null,null,{"$f":"IF(E756=\"\",\"\",IF(COUNTIF(E$6:E755,E756)<1,\"初\",IFERROR(VLOOKUP(INDEX(F$1:F755,_xlfn.AGGREGATE(14,6,ROW(E$6:E755)/(E$6:E755=E756),1)),{\"申\",\"　\";\"　\",\"申\"},2,0),\"\")))","v":""},null,null,null,null,null,null,null,null," "]
[null,null,null,null,null,{"$f":"IF(E757=\"\",\"\",IF(COUNTIF(E$6:E756,E757)<1,\"初\",IFERROR(VLOOKUP(INDEX(F$1:F756,_xlfn.AGGREGATE(14,6,ROW(E$6:E756)/(E$6:E756=E757),1)),{\"申\",\"　\";\"　\",\"申\"},2,0),\"\")))","v":""},null,null,null,null,null,null,null,null," "]
[null,null,null,null,null,{"$f":"IF(E758=\"\",\"\",IF(COUNTIF(E$6:E757,E758)<1,\"初\",IFERROR(VLOOKUP(INDEX(F$1:F757,_xlfn.AGGREGATE(14,6,ROW(E$6:E757)/(E$6:E757=E758),1)),{\"申\",\"　\";\"　\",\"申\"},2,0),\"\")))","v":""},null,null,null,null,null,null,null,null," "]
[null,null,null,null,null,{"$f":"IF(E759=\"\",\"\",IF(COUNTIF(E$6:E758,E759)<1,\"初\",IFERROR(VLOOKUP(INDEX(F$1:F758,_xlfn.AGGREGATE(14,6,ROW(E$6:E758)/(E$6:E758=E759),1)),{\"申\",\"　\";\"　\",\"申\"},2,0),\"\")))","v":""},null,null,null,null,null,null,null,null," "]
[null,null,null,null,null,{"$f":"IF(E760=\"\",\"\",IF(COUNTIF(E$6:E759,E760)<1,\"初\",IFERROR(VLOOKUP(INDEX(F$1:F759,_xlfn.AGGREGATE(14,6,ROW(E$6:E759)/(E$6:E759=E760),1)),{\"申\",\"　\";\"　\",\"申\"},2,0),\"\")))","v":""},null,null,null,null,null,null,null,null," "]
[null,null,null,null,null,{"$f":"IF(E761=\"\",\"\",IF(COUNTIF(E$6:E760,E761)<1,\"初\",IFERROR(VLOOKUP(INDEX(F$1:F760,_xlfn.AGGREGATE(14,6,ROW(E$6:E760)/(E$6:E760=E761),1)),{\"申\",\"　\";\"　\",\"申\"},2,0),\"\")))","v":""},null,null,null,null,null,null,null,null," "]
[null,null,null,null,null,{"$f":"IF(E762=\"\",\"\",IF(COUNTIF(E$6:E761,E762)<1,\"初\",IFERROR(VLOOKUP(INDEX(F$1:F761,_xlfn.AGGREGATE(14,6,ROW(E$6:E761)/(E$6:E761=E762),1)),{\"申\",\"　\";\"　\",\"申\"},2,0),\"\")))","v":""},null,null,null,null,null,null,null,null," "]
[null,null,null,null,null,{"$f":"IF(E763=\"\",\"\",IF(COUNTIF(E$6:E762,E763)<1,\"初\",IFERROR(VLOOKUP(INDEX(F$1:F762,_xlfn.AGGREGATE(14,6,ROW(E$6:E762)/(E$6:E762=E763),1)),{\"申\",\"　\";\"　\",\"申\"},2,0),\"\")))","v":""},null,null,null,null,null,null,null,null," "]
[null,null,null,null,null,{"$f":"IF(E764=\"\",\"\",IF(COUNTIF(E$6:E763,E764)<1,\"初\",IFERROR(VLOOKUP(INDEX(F$1:F763,_xlfn.AGGREGATE(14,6,ROW(E$6:E763)/(E$6:E763=E764),1)),{\"申\",\"　\";\"　\",\"申\"},2,0),\"\")))","v":""},null,null,null,null,null,null,null,null," "]
[null,null,null,null,null,{"$f":"IF(E765=\"\",\"\",IF(COUNTIF(E$6:E764,E765)<1,\"初\",IFERROR(VLOOKUP(INDEX(F$1:F764,_xlfn.AGGREGATE(14,6,ROW(E$6:E764)/(E$6:E764=E765),1)),{\"申\",\"　\";\"　\",\"申\"},2,0),\"\")))","v":""},null,null,null,null,null,null,null,null," "]
[null,null,null,null,null,{"$f":"IF(E766=\"\",\"\",IF(COUNTIF(E$6:E765,E766)<1,\"初\",IFERROR(VLOOKUP(INDEX(F$1:F765,_xlfn.AGGREGATE(14,6,ROW(E$6:E765)/(E$6:E765=E766),1)),{\"申\",\"　\";\"　\",\"申\"},2,0),\"\")))","v":""},null,null,null,null,null,null,null,null," "]
[null,null,null,null,null,{"$f":"IF(E767=\"\",\"\",IF(COUNTIF(E$6:E766,E767)<1,\"初\",IFERROR(VLOOKUP(INDEX(F$1:F766,_xlfn.AGGREGATE(14,6,ROW(E$6:E766)/(E$6:E766=E767),1)),{\"申\",\"　\";\"　\",\"申\"},2,0),\"\")))","v":""},null,null,null,null,null,null,null,null," "]
[null,null,null,null,null,{"$f":"IF(E768=\"\",\"\",IF(COUNTIF(E$6:E767,E768)<1,\"初\",IFERROR(VLOOKUP(INDEX(F$1:F767,_xlfn.AGGREGATE(14,6,ROW(E$6:E767)/(E$6:E767=E768),1)),{\"申\",\"　\";\"　\",\"申\"},2,0),\"\")))","v":""},null,null,null,null,null,null,null,null," "]
[null,null,null,null,null,{"$f":"IF(E769=\"\",\"\",IF(COUNTIF(E$6:E768,E769)<1,\"初\",IFERROR(VLOOKUP(INDEX(F$1:F768,_xlfn.AGGREGATE(14,6,ROW(E$6:E768)/(E$6:E768=E769),1)),{\"申\",\"　\";\"　\",\"申\"},2,0),\"\")))","v":""},null,null,null,null,null,null,null,null," "]
[null,null,null,null,null,{"$f":"IF(E770=\"\",\"\",IF(COUNTIF(E$6:E769,E770)<1,\"初\",IFERROR(VLOOKUP(INDEX(F$1:F769,_xlfn.AGGREGATE(14,6,ROW(E$6:E769)/(E$6:E769=E770),1)),{\"申\",\"　\";\"　\",\"申\"},2,0),\"\")))","v":""},null,null,null,null,null,null,null,null," "]
[null,null,null,null,null,{"$f":"IF(E771=\"\",\"\",IF(COUNTIF(E$6:E770,E771)<1,\"初\",IFERROR(VLOOKUP(INDEX(F$1:F770,_xlfn.AGGREGATE(14,6,ROW(E$6:E770)/(E$6:E770=E771),1)),{\"申\",\"　\";\"　\",\"申\"},2,0),\"\")))","v":""},null,null,null,null,null,null,null,null," "]
[null,null,null,null,null,{"$f":"IF(E772=\"\",\"\",IF(COUNTIF(E$6:E771,E772)<1,\"初\",IFERROR(VLOOKUP(INDEX(F$1:F771,_xlfn.AGGREGATE(14,6,ROW(E$6:E771)/(E$6:E771=E772),1)),{\"申\",\"　\";\"　\",\"申\"},2,0),\"\")))","v":""},null,null,null,null,null,null,null,null," "]
[null,null,null,null,null,{"$f":"IF(E773=\"\",\"\",IF(COUNTIF(E$6:E772,E773)<1,\"初\",IFERROR(VLOOKUP(INDEX(F$1:F772,_xlfn.AGGREGATE(14,6,ROW(E$6:E772)/(E$6:E772=E773),1)),{\"申\",\"　\";\"　\",\"申\"},2,0),\"\")))","v":""},null,null,null,null,null,null,null,null," "]
[null,null,null,null,null,{"$f":"IF(E774=\"\",\"\",IF(COUNTIF(E$6:E773,E774)<1,\"初\",IFERROR(VLOOKUP(INDEX(F$1:F773,_xlfn.AGGREGATE(14,6,ROW(E$6:E773)/(E$6:E773=E774),1)),{\"申\",\"　\";\"　\",\"申\"},2,0),\"\")))","v":""},null,null,null,null,null,null,null,null," "]
[null,null,null,null,null,{"$f":"IF(E775=\"\",\"\",IF(COUNTIF(E$6:E774,E775)<1,\"初\",IFERROR(VLOOKUP(INDEX(F$1:F774,_xlfn.AGGREGATE(14,6,ROW(E$6:E774)/(E$6:E774=E775),1)),{\"申\",\"　\";\"　\",\"申\"},2,0),\"\")))","v":""},null,null,null,null,null,null,null,null," "]
[null,null,null,null,null,{"$f":"IF(E776=\"\",\"\",IF(COUNTIF(E$6:E775,E776)<1,\"初\",IFERROR(VLOOKUP(INDEX(F$1:F775,_xlfn.AGGREGATE(14,6,ROW(E$6:E775)/(E$6:E775=E776),1)),{\"申\",\"　\";\"　\",\"申\"},2,0),\"\")))","v":""},null,null,null,null,null,null,null,null," "]
[null,null,null,null,null,{"$f":"IF(E777=\"\",\"\",IF(COUNTIF(E$6:E776,E777)<1,\"初\",IFERROR(VLOOKUP(INDEX(F$1:F776,_xlfn.AGGREGATE(14,6,ROW(E$6:E776)/(E$6:E776=E777),1)),{\"申\",\"　\";\"　\",\"申\"},2,0),\"\")))","v":""},null,null,null,null,null,null,null,null," "]
[null,null,null,null,null,{"$f":"IF(E778=\"\",\"\",IF(COUNTIF(E$6:E777,E778)<1,\"初\",IFERROR(VLOOKUP(INDEX(F$1:F777,_xlfn.AGGREGATE(14,6,ROW(E$6:E777)/(E$6:E777=E778),1)),{\"申\",\"　\";\"　\",\"申\"},2,0),\"\")))","v":""},null,null,null,null,null,null,null,null," "]
[null,null,null,null,null,{"$f":"IF(E779=\"\",\"\",IF(COUNTIF(E$6:E778,E779)<1,\"初\",IFERROR(VLOOKUP(INDEX(F$1:F778,_xlfn.AGGREGATE(14,6,ROW(E$6:E778)/(E$6:E778=E779),1)),{\"申\",\"　\";\"　\",\"申\"},2,0),\"\")))","v":""},null,null,null,null,null,null,null,null," "]
[null,null,null,null,null,{"$f":"IF(E780=\"\",\"\",IF(COUNTIF(E$6:E779,E780)<1,\"初\",IFERROR(VLOOKUP(INDEX(F$1:F779,_xlfn.AGGREGATE(14,6,ROW(E$6:E779)/(E$6:E779=E780),1)),{\"申\",\"　\";\"　\",\"申\"},2,0),\"\")))","v":""},null,null,null,null,null,null,null,null," "]
[null,null,null,null,null,{"$f":"IF(E781=\"\",\"\",IF(COUNTIF(E$6:E780,E781)<1,\"初\",IFERROR(VLOOKUP(INDEX(F$1:F780,_xlfn.AGGREGATE(14,6,ROW(E$6:E780)/(E$6:E780=E781),1)),{\"申\",\"　\";\"　\",\"申\"},2,0),\"\")))","v":""},null,null,null,null,null,null,null,null," "]
[null,null,null,null,null,{"$f":"IF(E782=\"\",\"\",IF(COUNTIF(E$6:E781,E782)<1,\"初\",IFERROR(VLOOKUP(INDEX(F$1:F781,_xlfn.AGGREGATE(14,6,ROW(E$6:E781)/(E$6:E781=E782),1)),{\"申\",\"　\";\"　\",\"申\"},2,0),\"\")))","v":""},null,null,null,null,null,null,null,null," "]
[null,null,null,null,null,{"$f":"IF(E783=\"\",\"\",IF(COUNTIF(E$6:E782,E783)<1,\"初\",IFERROR(VLOOKUP(INDEX(F$1:F782,_xlfn.AGGREGATE(14,6,ROW(E$6:E782)/(E$6:E782=E783),1)),{\"申\",\"　\";\"　\",\"申\"},2,0),\"\")))","v":""},null,null,null,null,null,null,null,null," "]
[null,null,null,null,null,{"$f":"IF(E784=\"\",\"\",IF(COUNTIF(E$6:E783,E784)<1,\"初\",IFERROR(VLOOKUP(INDEX(F$1:F783,_xlfn.AGGREGATE(14,6,ROW(E$6:E783)/(E$6:E783=E784),1)),{\"申\",\"　\";\"　\",\"申\"},2,0),\"\")))","v":""},null,null,null,null,null,null,null,null," "]
[null,null,null,null,null,{"$f":"IF(E785=\"\",\"\",IF(COUNTIF(E$6:E784,E785)<1,\"初\",IFERROR(VLOOKUP(INDEX(F$1:F784,_xlfn.AGGREGATE(14,6,ROW(E$6:E784)/(E$6:E784=E785),1)),{\"申\",\"　\";\"　\",\"申\"},2,0),\"\")))","v":""},null,null,null,null,null,null,null,null," "]
[null,null,null,null,null,{"$f":"IF(E786=\"\",\"\",IF(COUNTIF(E$6:E785,E786)<1,\"初\",IFERROR(VLOOKUP(INDEX(F$1:F785,_xlfn.AGGREGATE(14,6,ROW(E$6:E785)/(E$6:E785=E786),1)),{\"申\",\"　\";\"　\",\"申\"},2,0),\"\")))","v":""},null,null,null,null,null,null,null,null," "]
[null,null,null,null,null,{"$f":"IF(E787=\"\",\"\",IF(COUNTIF(E$6:E786,E787)<1,\"初\",IFERROR(VLOOKUP(INDEX(F$1:F786,_xlfn.AGGREGATE(14,6,ROW(E$6:E786)/(E$6:E786=E787),1)),{\"申\",\"　\";\"　\",\"申\"},2,0),\"\")))","v":""},null,null,null,null,null,null,null,null," "]
[null,null,null,null,null,{"$f":"IF(E788=\"\",\"\",IF(COUNTIF(E$6:E787,E788)<1,\"初\",IFERROR(VLOOKUP(INDEX(F$1:F787,_xlfn.AGGREGATE(14,6,ROW(E$6:E787)/(E$6:E787=E788),1)),{\"申\",\"　\";\"　\",\"申\"},2,0),\"\")))","v":""},null,null,null,null,null,null,null,null," "]
[null,null,null,null,null,{"$f":"IF(E789=\"\",\"\",IF(COUNTIF(E$6:E788,E789)<1,\"初\",IFERROR(VLOOKUP(INDEX(F$1:F788,_xlfn.AGGREGATE(14,6,ROW(E$6:E788)/(E$6:E788=E789),1)),{\"申\",\"　\";\"　\",\"申\"},2,0),\"\")))","v":""},null,null,null,null,null,null,null,null," "]
[null,null,null,null,null,{"$f":"IF(E790=\"\",\"\",IF(COUNTIF(E$6:E789,E790)<1,\"初\",IFERROR(VLOOKUP(INDEX(F$1:F789,_xlfn.AGGREGATE(14,6,ROW(E$6:E789)/(E$6:E789=E790),1)),{\"申\",\"　\";\"　\",\"申\"},2,0),\"\")))","v":""},null,null,null,null,null,null,null,null," "]
[null,null,null,null,null,{"$f":"IF(E791=\"\",\"\",IF(COUNTIF(E$6:E790,E791)<1,\"初\",IFERROR(VLOOKUP(INDEX(F$1:F790,_xlfn.AGGREGATE(14,6,ROW(E$6:E790)/(E$6:E790=E791),1)),{\"申\",\"　\";\"　\",\"申\"},2,0),\"\")))","v":""},null,null,null,null,null,null,null,null," "]
[null,null,null,null,null,{"$f":"IF(E792=\"\",\"\",IF(COUNTIF(E$6:E791,E792)<1,\"初\",IFERROR(VLOOKUP(INDEX(F$1:F791,_xlfn.AGGREGATE(14,6,ROW(E$6:E791)/(E$6:E791=E792),1)),{\"申\",\"　\";\"　\",\"申\"},2,0),\"\")))","v":""},null,null,null,null,null,null,null,null," "]
[null,null,null,null,null,{"$f":"IF(E793=\"\",\"\",IF(COUNTIF(E$6:E792,E793)<1,\"初\",IFERROR(VLOOKUP(INDEX(F$1:F792,_xlfn.AGGREGATE(14,6,ROW(E$6:E792)/(E$6:E792=E793),1)),{\"申\",\"　\";\"　\",\"申\"},2,0),\"\")))","v":""},null,null,null,null,null,null,null,null," "]
[null,null,null,null,null,{"$f":"IF(E794=\"\",\"\",IF(COUNTIF(E$6:E793,E794)<1,\"初\",IFERROR(VLOOKUP(INDEX(F$1:F793,_xlfn.AGGREGATE(14,6,ROW(E$6:E793)/(E$6:E793=E794),1)),{\"申\",\"　\";\"　\",\"申\"},2,0),\"\")))","v":""},null,null,null,null,null,null,null,null," "]
[null,null,null,null,null,{"$f":"IF(E795=\"\",\"\",IF(COUNTIF(E$6:E794,E795)<1,\"初\",IFERROR(VLOOKUP(INDEX(F$1:F794,_xlfn.AGGREGATE(14,6,ROW(E$6:E794)/(E$6:E794=E795),1)),{\"申\",\"　\";\"　\",\"申\"},2,0),\"\")))","v":""},null,null,null,null,null,null,null,null," "]
[null,null,null,null,null,{"$f":"IF(E796=\"\",\"\",IF(COUNTIF(E$6:E795,E796)<1,\"初\",IFERROR(VLOOKUP(INDEX(F$1:F795,_xlfn.AGGREGATE(14,6,ROW(E$6:E795)/(E$6:E795=E796),1)),{\"申\",\"　\";\"　\",\"申\"},2,0),\"\")))","v":""},null,null,null,null,null,null,null,null," "]
[null,null,null,null,null,{"$f":"IF(E797=\"\",\"\",IF(COUNTIF(E$6:E796,E797)<1,\"初\",IFERROR(VLOOKUP(INDEX(F$1:F796,_xlfn.AGGREGATE(14,6,ROW(E$6:E796)/(E$6:E796=E797),1)),{\"申\",\"　\";\"　\",\"申\"},2,0),\"\")))","v":""},null,null,null,null,null,null,null,null," "]
[null,null,null,null,null,{"$f":"IF(E798=\"\",\"\",IF(COUNTIF(E$6:E797,E798)<1,\"初\",IFERROR(VLOOKUP(INDEX(F$1:F797,_xlfn.AGGREGATE(14,6,ROW(E$6:E797)/(E$6:E797=E798),1)),{\"申\",\"　\";\"　\",\"申\"},2,0),\"\")))","v":""},null,null,null,null,null,null,null,null," "]
[null,null,null,null,null,{"$f":"IF(E799=\"\",\"\",IF(COUNTIF(E$6:E798,E799)<1,\"初\",IFERROR(VLOOKUP(INDEX(F$1:F798,_xlfn.AGGREGATE(14,6,ROW(E$6:E798)/(E$6:E798=E799),1)),{\"申\",\"　\";\"　\",\"申\"},2,0),\"\")))","v":""},null,null,null,null,null,null,null,null,{"$f":"IF(ISERROR(LEFT(E799,FIND(\"　\",E799,1)-1)&\" \"&LEFT(G799,FIND(\"　\",G799,1)-1)&\" \"&K799&L799&\" \"&H799&IF(I799<>\"\",\"or\"&I799,\"\")&J799&M799&N799), \"\", LEFT(E799,FIND(\"　\",E799,1)-1)&\" \"&LEFT(G799,FIND(\"　\",G799,1)-1)&\" \"&K799&L799&\" \"&H799&IF(I799<>\"\",\"or\"&I799,\"\")&J799&M799&N799)&\" \"&F799","v":" "}]
[null,null,null,null,null,{"$f":"IF(E800=\"\",\"\",IF(COUNTIF(E$6:E799,E800)<1,\"初\",IFERROR(VLOOKUP(INDEX(F$1:F799,_xlfn.AGGREGATE(14,6,ROW(E$6:E799)/(E$6:E799=E800),1)),{\"申\",\"　\";\"　\",\"申\"},2,0),\"\")))","v":""},null,null,null,null,null,null,null,null," "]
[null,null,null,null,null,{"$f":"IF(E801=\"\",\"\",IF(COUNTIF(E$6:E800,E801)<1,\"初\",IFERROR(VLOOKUP(INDEX(F$1:F800,_xlfn.AGGREGATE(14,6,ROW(E$6:E800)/(E$6:E800=E801),1)),{\"申\",\"　\";\"　\",\"申\"},2,0),\"\")))","v":""},null,null,null,null,null,null,null,null," "]
[null,null,null,null,null,{"$f":"IF(E802=\"\",\"\",IF(COUNTIF(E$6:E801,E802)<1,\"初\",IFERROR(VLOOKUP(INDEX(F$1:F801,_xlfn.AGGREGATE(14,6,ROW(E$6:E801)/(E$6:E801=E802),1)),{\"申\",\"　\";\"　\",\"申\"},2,0),\"\")))","v":""},null,null,null,null,null,null,null,null," "]
[null,null,null,null,null,{"$f":"IF(E803=\"\",\"\",IF(COUNTIF(E$6:E802,E803)<1,\"初\",IFERROR(VLOOKUP(INDEX(F$1:F802,_xlfn.AGGREGATE(14,6,ROW(E$6:E802)/(E$6:E802=E803),1)),{\"申\",\"　\";\"　\",\"申\"},2,0),\"\")))","v":""},null,null,null,null,null,null,null,null," "]
[null,null,null,null,null,{"$f":"IF(E804=\"\",\"\",IF(COUNTIF(E$6:E803,E804)<1,\"初\",IFERROR(VLOOKUP(INDEX(F$1:F803,_xlfn.AGGREGATE(14,6,ROW(E$6:E803)/(E$6:E803=E804),1)),{\"申\",\"　\";\"　\",\"申\"},2,0),\"\")))","v":""},null,null,null,null,null,null,null,null," "]
[null,null,null,null,null,{"$f":"IF(E805=\"\",\"\",IF(COUNTIF(E$6:E804,E805)<1,\"初\",IFERROR(VLOOKUP(INDEX(F$1:F804,_xlfn.AGGREGATE(14,6,ROW(E$6:E804)/(E$6:E804=E805),1)),{\"申\",\"　\";\"　\",\"申\"},2,0),\"\")))","v":""},null,null,null,null,null,null,null,null," "]
[null,null,null,null,null,{"$f":"IF(E806=\"\",\"\",IF(COUNTIF(E$6:E805,E806)<1,\"初\",IFERROR(VLOOKUP(INDEX(F$1:F805,_xlfn.AGGREGATE(14,6,ROW(E$6:E805)/(E$6:E805=E806),1)),{\"申\",\"　\";\"　\",\"申\"},2,0),\"\")))","v":""},null,null,null,null,null,null,null,null," "]
[null,null,null,null,null,{"$f":"IF(E807=\"\",\"\",IF(COUNTIF(E$6:E806,E807)<1,\"初\",IFERROR(VLOOKUP(INDEX(F$1:F806,_xlfn.AGGREGATE(14,6,ROW(E$6:E806)/(E$6:E806=E807),1)),{\"申\",\"　\";\"　\",\"申\"},2,0),\"\")))","v":""},null,null,null,null,null,null,null,null," "]
[null,null,null,null,null,{"$f":"IF(E808=\"\",\"\",IF(COUNTIF(E$6:E807,E808)<1,\"初\",IFERROR(VLOOKUP(INDEX(F$1:F807,_xlfn.AGGREGATE(14,6,ROW(E$6:E807)/(E$6:E807=E808),1)),{\"申\",\"　\";\"　\",\"申\"},2,0),\"\")))","v":""},null,null,null,null,null,null,null,null," "]
[null,null,null,null,null,{"$f":"IF(E809=\"\",\"\",IF(COUNTIF(E$6:E808,E809)<1,\"初\",IFERROR(VLOOKUP(INDEX(F$1:F808,_xlfn.AGGREGATE(14,6,ROW(E$6:E808)/(E$6:E808=E809),1)),{\"申\",\"　\";\"　\",\"申\"},2,0),\"\")))","v":""},null,null,null,null,null,null,null,null," "]
[null,null,null,null,null,{"$f":"IF(E810=\"\",\"\",IF(COUNTIF(E$6:E809,E810)<1,\"初\",IFERROR(VLOOKUP(INDEX(F$1:F809,_xlfn.AGGREGATE(14,6,ROW(E$6:E809)/(E$6:E809=E810),1)),{\"申\",\"　\";\"　\",\"申\"},2,0),\"\")))","v":""},null,null,null,null,null,null,null,null," "]
[null,null,null,null,null,{"$f":"IF(E811=\"\",\"\",IF(COUNTIF(E$6:E810,E811)<1,\"初\",IFERROR(VLOOKUP(INDEX(F$1:F810,_xlfn.AGGREGATE(14,6,ROW(E$6:E810)/(E$6:E810=E811),1)),{\"申\",\"　\";\"　\",\"申\"},2,0),\"\")))","v":""},null,null,null,null,null,null,null,null," "]
[null,null,null,null,null,{"$f":"IF(E812=\"\",\"\",IF(COUNTIF(E$6:E811,E812)<1,\"初\",IFERROR(VLOOKUP(INDEX(F$1:F811,_xlfn.AGGREGATE(14,6,ROW(E$6:E811)/(E$6:E811=E812),1)),{\"申\",\"　\";\"　\",\"申\"},2,0),\"\")))","v":""},null,null,null,null,null,null,null,null," "]
[null,null,null,null,null,{"$f":"IF(E813=\"\",\"\",IF(COUNTIF(E$6:E812,E813)<1,\"初\",IFERROR(VLOOKUP(INDEX(F$1:F812,_xlfn.AGGREGATE(14,6,ROW(E$6:E812)/(E$6:E812=E813),1)),{\"申\",\"　\";\"　\",\"申\"},2,0),\"\")))","v":""},null,null,null,null,null,null,null,null," "]
[null,null,null,null,null,{"$f":"IF(E814=\"\",\"\",IF(COUNTIF(E$6:E813,E814)<1,\"初\",IFERROR(VLOOKUP(INDEX(F$1:F813,_xlfn.AGGREGATE(14,6,ROW(E$6:E813)/(E$6:E813=E814),1)),{\"申\",\"　\";\"　\",\"申\"},2,0),\"\")))","v":""},null,null,null,null,null,null,null,null," "]
[null,null,null,null,null,{"$f":"IF(E815=\"\",\"\",IF(COUNTIF(E$6:E814,E815)<1,\"初\",IFERROR(VLOOKUP(INDEX(F$1:F814,_xlfn.AGGREGATE(14,6,ROW(E$6:E814)/(E$6:E814=E815),1)),{\"申\",\"　\";\"　\",\"申\"},2,0),\"\")))","v":""},null,null,null,null,null,null,null,null," "]
[null,null,null,null,null,{"$f":"IF(E816=\"\",\"\",IF(COUNTIF(E$6:E815,E816)<1,\"初\",IFERROR(VLOOKUP(INDEX(F$1:F815,_xlfn.AGGREGATE(14,6,ROW(E$6:E815)/(E$6:E815=E816),1)),{\"申\",\"　\";\"　\",\"申\"},2,0),\"\")))","v":""},null,null,null,null,null,null,null,null," "]
[null,null,null,null,null,{"$f":"IF(E817=\"\",\"\",IF(COUNTIF(E$6:E816,E817)<1,\"初\",IFERROR(VLOOKUP(INDEX(F$1:F816,_xlfn.AGGREGATE(14,6,ROW(E$6:E816)/(E$6:E816=E817),1)),{\"申\",\"　\";\"　\",\"申\"},2,0),\"\")))","v":""},null,null,null,null,null,null,null,null," "]
[null,null,null,null,null,{"$f":"IF(E818=\"\",\"\",IF(COUNTIF(E$6:E817,E818)<1,\"初\",IFERROR(VLOOKUP(INDEX(F$1:F817,_xlfn.AGGREGATE(14,6,ROW(E$6:E817)/(E$6:E817=E818),1)),{\"申\",\"　\";\"　\",\"申\"},2,0),\"\")))","v":""},null,null,null,null,null,null,null,null," "]
[null,null,null,null,null,{"$f":"IF(E819=\"\",\"\",IF(COUNTIF(E$6:E818,E819)<1,\"初\",IFERROR(VLOOKUP(INDEX(F$1:F818,_xlfn.AGGREGATE(14,6,ROW(E$6:E818)/(E$6:E818=E819),1)),{\"申\",\"　\";\"　\",\"申\"},2,0),\"\")))","v":""},null,null,null,null,null,null,null,null," "]
[null,null,null,null,null,{"$f":"IF(E820=\"\",\"\",IF(COUNTIF(E$6:E819,E820)<1,\"初\",IFERROR(VLOOKUP(INDEX(F$1:F819,_xlfn.AGGREGATE(14,6,ROW(E$6:E819)/(E$6:E819=E820),1)),{\"申\",\"　\";\"　\",\"申\"},2,0),\"\")))","v":""},null,null,null,null,null,null,null,null," "]
[null,null,null,null,null,{"$f":"IF(E821=\"\",\"\",IF(COUNTIF(E$6:E820,E821)<1,\"初\",IFERROR(VLOOKUP(INDEX(F$1:F820,_xlfn.AGGREGATE(14,6,ROW(E$6:E820)/(E$6:E820=E821),1)),{\"申\",\"　\";\"　\",\"申\"},2,0),\"\")))","v":""},null,null,null,null,null,null,null,null," "]
[null,null,null,null,null,{"$f":"IF(E822=\"\",\"\",IF(COUNTIF(E$6:E821,E822)<1,\"初\",IFERROR(VLOOKUP(INDEX(F$1:F821,_xlfn.AGGREGATE(14,6,ROW(E$6:E821)/(E$6:E821=E822),1)),{\"申\",\"　\";\"　\",\"申\"},2,0),\"\")))","v":""},null,null,null,null,null,null,null,null," "]
[null,null,null,null,null,{"$f":"IF(E823=\"\",\"\",IF(COUNTIF(E$6:E822,E823)<1,\"初\",IFERROR(VLOOKUP(INDEX(F$1:F822,_xlfn.AGGREGATE(14,6,ROW(E$6:E822)/(E$6:E822=E823),1)),{\"申\",\"　\";\"　\",\"申\"},2,0),\"\")))","v":""},null,null,null,null,null,null,null,null," "]
[null,null,null,null,null,{"$f":"IF(E824=\"\",\"\",IF(COUNTIF(E$6:E823,E824)<1,\"初\",IFERROR(VLOOKUP(INDEX(F$1:F823,_xlfn.AGGREGATE(14,6,ROW(E$6:E823)/(E$6:E823=E824),1)),{\"申\",\"　\";\"　\",\"申\"},2,0),\"\")))","v":""},null,null,null,null,null,null,null,null," "]
[null,null,null,null,null,{"$f":"IF(E825=\"\",\"\",IF(COUNTIF(E$6:E824,E825)<1,\"初\",IFERROR(VLOOKUP(INDEX(F$1:F824,_xlfn.AGGREGATE(14,6,ROW(E$6:E824)/(E$6:E824=E825),1)),{\"申\",\"　\";\"　\",\"申\"},2,0),\"\")))","v":""},null,null,null,null,null,null,null,null," "]
[null,null,null,null,null,{"$f":"IF(E826=\"\",\"\",IF(COUNTIF(E$6:E825,E826)<1,\"初\",IFERROR(VLOOKUP(INDEX(F$1:F825,_xlfn.AGGREGATE(14,6,ROW(E$6:E825)/(E$6:E825=E826),1)),{\"申\",\"　\";\"　\",\"申\"},2,0),\"\")))","v":""},null,null,null,null,null,null,null,null," "]
[null,null,null,null,null,{"$f":"IF(E827=\"\",\"\",IF(COUNTIF(E$6:E826,E827)<1,\"初\",IFERROR(VLOOKUP(INDEX(F$1:F826,_xlfn.AGGREGATE(14,6,ROW(E$6:E826)/(E$6:E826=E827),1)),{\"申\",\"　\";\"　\",\"申\"},2,0),\"\")))","v":""},null,null,null,null,null,null,null,null," "]
[null,null,null,null,null,{"$f":"IF(E828=\"\",\"\",IF(COUNTIF(E$6:E827,E828)<1,\"初\",IFERROR(VLOOKUP(INDEX(F$1:F827,_xlfn.AGGREGATE(14,6,ROW(E$6:E827)/(E$6:E827=E828),1)),{\"申\",\"　\";\"　\",\"申\"},2,0),\"\")))","v":""},null,null,null,null,null,null,null,null," "]
[null,null,null,null,null,{"$f":"IF(E829=\"\",\"\",IF(COUNTIF(E$6:E828,E829)<1,\"初\",IFERROR(VLOOKUP(INDEX(F$1:F828,_xlfn.AGGREGATE(14,6,ROW(E$6:E828)/(E$6:E828=E829),1)),{\"申\",\"　\";\"　\",\"申\"},2,0),\"\")))","v":""},null,null,null,null,null,null,null,null," "]
[null,null,null,null,null,{"$f":"IF(E830=\"\",\"\",IF(COUNTIF(E$6:E829,E830)<1,\"初\",IFERROR(VLOOKUP(INDEX(F$1:F829,_xlfn.AGGREGATE(14,6,ROW(E$6:E829)/(E$6:E829=E830),1)),{\"申\",\"　\";\"　\",\"申\"},2,0),\"\")))","v":""},null,null,null,null,null,null,null,null," "]
[null,null,null,null,null,{"$f":"IF(E831=\"\",\"\",IF(COUNTIF(E$6:E830,E831)<1,\"初\",IFERROR(VLOOKUP(INDEX(F$1:F830,_xlfn.AGGREGATE(14,6,ROW(E$6:E830)/(E$6:E830=E831),1)),{\"申\",\"　\";\"　\",\"申\"},2,0),\"\")))","v":""},null,null,null,null,null,null,null,null," "]
[null,null,null,null,null,{"$f":"IF(E832=\"\",\"\",IF(COUNTIF(E$6:E831,E832)<1,\"初\",IFERROR(VLOOKUP(INDEX(F$1:F831,_xlfn.AGGREGATE(14,6,ROW(E$6:E831)/(E$6:E831=E832),1)),{\"申\",\"　\";\"　\",\"申\"},2,0),\"\")))","v":""},null,null,null,null,null,null,null,null," "]
[null,null,null,null,null,{"$f":"IF(E833=\"\",\"\",IF(COUNTIF(E$6:E832,E833)<1,\"初\",IFERROR(VLOOKUP(INDEX(F$1:F832,_xlfn.AGGREGATE(14,6,ROW(E$6:E832)/(E$6:E832=E833),1)),{\"申\",\"　\";\"　\",\"申\"},2,0),\"\")))","v":""},null,null,null,null,null,null,null,null," "]
[null,null,null,null,null,{"$f":"IF(E834=\"\",\"\",IF(COUNTIF(E$6:E833,E834)<1,\"初\",IFERROR(VLOOKUP(INDEX(F$1:F833,_xlfn.AGGREGATE(14,6,ROW(E$6:E833)/(E$6:E833=E834),1)),{\"申\",\"　\";\"　\",\"申\"},2,0),\"\")))","v":""},null,null,null,null,null,null,null,null," "]
[null,null,null,null,null,{"$f":"IF(E835=\"\",\"\",IF(COUNTIF(E$6:E834,E835)<1,\"初\",IFERROR(VLOOKUP(INDEX(F$1:F834,_xlfn.AGGREGATE(14,6,ROW(E$6:E834)/(E$6:E834=E835),1)),{\"申\",\"　\";\"　\",\"申\"},2,0),\"\")))","v":""},null,null,null,null,null,null,null,null," "]
[null,null,null,null,null,{"$f":"IF(E836=\"\",\"\",IF(COUNTIF(E$6:E835,E836)<1,\"初\",IFERROR(VLOOKUP(INDEX(F$1:F835,_xlfn.AGGREGATE(14,6,ROW(E$6:E835)/(E$6:E835=E836),1)),{\"申\",\"　\";\"　\",\"申\"},2,0),\"\")))","v":""},null,null,null,null,null,null,null,null," "]
[null,null,null,null,null,{"$f":"IF(E837=\"\",\"\",IF(COUNTIF(E$6:E836,E837)<1,\"初\",IFERROR(VLOOKUP(INDEX(F$1:F836,_xlfn.AGGREGATE(14,6,ROW(E$6:E836)/(E$6:E836=E837),1)),{\"申\",\"　\";\"　\",\"申\"},2,0),\"\")))","v":""},null,null,null,null,null,null,null,null," "]
[null,null,null,null,null,{"$f":"IF(E838=\"\",\"\",IF(COUNTIF(E$6:E837,E838)<1,\"初\",IFERROR(VLOOKUP(INDEX(F$1:F837,_xlfn.AGGREGATE(14,6,ROW(E$6:E837)/(E$6:E837=E838),1)),{\"申\",\"　\";\"　\",\"申\"},2,0),\"\")))","v":""},null,null,null,null,null,null,null,null," "]
[null,null,null,null,null,{"$f":"IF(E839=\"\",\"\",IF(COUNTIF(E$6:E838,E839)<1,\"初\",IFERROR(VLOOKUP(INDEX(F$1:F838,_xlfn.AGGREGATE(14,6,ROW(E$6:E838)/(E$6:E838=E839),1)),{\"申\",\"　\";\"　\",\"申\"},2,0),\"\")))","v":""},null,null,null,null,null,null,null,null," "]
[null,null,null,null,null,{"$f":"IF(E840=\"\",\"\",IF(COUNTIF(E$6:E839,E840)<1,\"初\",IFERROR(VLOOKUP(INDEX(F$1:F839,_xlfn.AGGREGATE(14,6,ROW(E$6:E839)/(E$6:E839=E840),1)),{\"申\",\"　\";\"　\",\"申\"},2,0),\"\")))","v":""},null,null,null,null,null,null,null,null," "]
[null,null,null,null,null,{"$f":"IF(E841=\"\",\"\",IF(COUNTIF(E$6:E840,E841)<1,\"初\",IFERROR(VLOOKUP(INDEX(F$1:F840,_xlfn.AGGREGATE(14,6,ROW(E$6:E840)/(E$6:E840=E841),1)),{\"申\",\"　\";\"　\",\"申\"},2,0),\"\")))","v":""},null,null,null,null,null,null,null,null," "]
[null,null,null,null,null,{"$f":"IF(E842=\"\",\"\",IF(COUNTIF(E$6:E841,E842)<1,\"初\",IFERROR(VLOOKUP(INDEX(F$1:F841,_xlfn.AGGREGATE(14,6,ROW(E$6:E841)/(E$6:E841=E842),1)),{\"申\",\"　\";\"　\",\"申\"},2,0),\"\")))","v":""},null,null,null,null,null,null,null,null," "]
[null,null,null,null,null,{"$f":"IF(E843=\"\",\"\",IF(COUNTIF(E$6:E842,E843)<1,\"初\",IFERROR(VLOOKUP(INDEX(F$1:F842,_xlfn.AGGREGATE(14,6,ROW(E$6:E842)/(E$6:E842=E843),1)),{\"申\",\"　\";\"　\",\"申\"},2,0),\"\")))","v":""},null,null,null,null,null,null,null,null," "]
[null,null,null,null,null,{"$f":"IF(E844=\"\",\"\",IF(COUNTIF(E$6:E843,E844)<1,\"初\",IFERROR(VLOOKUP(INDEX(F$1:F843,_xlfn.AGGREGATE(14,6,ROW(E$6:E843)/(E$6:E843=E844),1)),{\"申\",\"　\";\"　\",\"申\"},2,0),\"\")))","v":""},null,null,null,null,null,null,null,null," "]
[null,null,null,null,null,{"$f":"IF(E845=\"\",\"\",IF(COUNTIF(E$6:E844,E845)<1,\"初\",IFERROR(VLOOKUP(INDEX(F$1:F844,_xlfn.AGGREGATE(14,6,ROW(E$6:E844)/(E$6:E844=E845),1)),{\"申\",\"　\";\"　\",\"申\"},2,0),\"\")))","v":""},null,null,null,null,null,null,null,null," "]
[null,null,null,null,null,{"$f":"IF(E846=\"\",\"\",IF(COUNTIF(E$6:E845,E846)<1,\"初\",IFERROR(VLOOKUP(INDEX(F$1:F845,_xlfn.AGGREGATE(14,6,ROW(E$6:E845)/(E$6:E845=E846),1)),{\"申\",\"　\";\"　\",\"申\"},2,0),\"\")))","v":""},null,null,null,null,null,null,null,null," "]
[null,null,null,null,null,{"$f":"IF(E847=\"\",\"\",IF(COUNTIF(E$6:E846,E847)<1,\"初\",IFERROR(VLOOKUP(INDEX(F$1:F846,_xlfn.AGGREGATE(14,6,ROW(E$6:E846)/(E$6:E846=E847),1)),{\"申\",\"　\";\"　\",\"申\"},2,0),\"\")))","v":""},null,null,null,null,null,null,null,null," "]
[null,null,null,null,null,{"$f":"IF(E848=\"\",\"\",IF(COUNTIF(E$6:E847,E848)<1,\"初\",IFERROR(VLOOKUP(INDEX(F$1:F847,_xlfn.AGGREGATE(14,6,ROW(E$6:E847)/(E$6:E847=E848),1)),{\"申\",\"　\";\"　\",\"申\"},2,0),\"\")))","v":""},null,null,null,null,null,null,null,null," "]
[null,null,null,null,null,{"$f":"IF(E849=\"\",\"\",IF(COUNTIF(E$6:E848,E849)<1,\"初\",IFERROR(VLOOKUP(INDEX(F$1:F848,_xlfn.AGGREGATE(14,6,ROW(E$6:E848)/(E$6:E848=E849),1)),{\"申\",\"　\";\"　\",\"申\"},2,0),\"\")))","v":""},null,null,null,null,null,null,null,null," "]
[null,null,null,null,null,{"$f":"IF(E850=\"\",\"\",IF(COUNTIF(E$6:E849,E850)<1,\"初\",IFERROR(VLOOKUP(INDEX(F$1:F849,_xlfn.AGGREGATE(14,6,ROW(E$6:E849)/(E$6:E849=E850),1)),{\"申\",\"　\";\"　\",\"申\"},2,0),\"\")))","v":""},null,null,null,null,null,null,null,null," "]
[null,null,null,null,null,{"$f":"IF(E851=\"\",\"\",IF(COUNTIF(E$6:E850,E851)<1,\"初\",IFERROR(VLOOKUP(INDEX(F$1:F850,_xlfn.AGGREGATE(14,6,ROW(E$6:E850)/(E$6:E850=E851),1)),{\"申\",\"　\";\"　\",\"申\"},2,0),\"\")))","v":""},null,null,null,null,null,null,null,null," "]
[null,null,null,null,null,{"$f":"IF(E852=\"\",\"\",IF(COUNTIF(E$6:E851,E852)<1,\"初\",IFERROR(VLOOKUP(INDEX(F$1:F851,_xlfn.AGGREGATE(14,6,ROW(E$6:E851)/(E$6:E851=E852),1)),{\"申\",\"　\";\"　\",\"申\"},2,0),\"\")))","v":""},null,null,null,null,null,null,null,null," "]
[null,null,null,null,null,{"$f":"IF(E853=\"\",\"\",IF(COUNTIF(E$6:E852,E853)<1,\"初\",IFERROR(VLOOKUP(INDEX(F$1:F852,_xlfn.AGGREGATE(14,6,ROW(E$6:E852)/(E$6:E852=E853),1)),{\"申\",\"　\";\"　\",\"申\"},2,0),\"\")))","v":""},null,null,null,null,null,null,null,null," "]
[null,null,null,null,null,{"$f":"IF(E854=\"\",\"\",IF(COUNTIF(E$6:E853,E854)<1,\"初\",IFERROR(VLOOKUP(INDEX(F$1:F853,_xlfn.AGGREGATE(14,6,ROW(E$6:E853)/(E$6:E853=E854),1)),{\"申\",\"　\";\"　\",\"申\"},2,0),\"\")))","v":""},null,null,null,null,null,null,null,null," "]
[null,null,null,null,null,{"$f":"IF(E855=\"\",\"\",IF(COUNTIF(E$6:E854,E855)<1,\"初\",IFERROR(VLOOKUP(INDEX(F$1:F854,_xlfn.AGGREGATE(14,6,ROW(E$6:E854)/(E$6:E854=E855),1)),{\"申\",\"　\";\"　\",\"申\"},2,0),\"\")))","v":""},null,null,null,null,null,null,null,null," "]
[null,null,null,null,null,{"$f":"IF(E856=\"\",\"\",IF(COUNTIF(E$6:E855,E856)<1,\"初\",IFERROR(VLOOKUP(INDEX(F$1:F855,_xlfn.AGGREGATE(14,6,ROW(E$6:E855)/(E$6:E855=E856),1)),{\"申\",\"　\";\"　\",\"申\"},2,0),\"\")))","v":""},null,null,null,null,null,null,null,null," "]
[null,null,null,null,null,{"$f":"IF(E857=\"\",\"\",IF(COUNTIF(E$6:E856,E857)<1,\"初\",IFERROR(VLOOKUP(INDEX(F$1:F856,_xlfn.AGGREGATE(14,6,ROW(E$6:E856)/(E$6:E856=E857),1)),{\"申\",\"　\";\"　\",\"申\"},2,0),\"\")))","v":""},null,null,null,null,null,null,null,null," "]
[null,null,null,null,null,{"$f":"IF(E858=\"\",\"\",IF(COUNTIF(E$6:E857,E858)<1,\"初\",IFERROR(VLOOKUP(INDEX(F$1:F857,_xlfn.AGGREGATE(14,6,ROW(E$6:E857)/(E$6:E857=E858),1)),{\"申\",\"　\";\"　\",\"申\"},2,0),\"\")))","v":""},null,null,null,null,null,null,null,null," "]
[null,null,null,null,null,{"$f":"IF(E859=\"\",\"\",IF(COUNTIF(E$6:E858,E859)<1,\"初\",IFERROR(VLOOKUP(INDEX(F$1:F858,_xlfn.AGGREGATE(14,6,ROW(E$6:E858)/(E$6:E858=E859),1)),{\"申\",\"　\";\"　\",\"申\"},2,0),\"\")))","v":""},null,null,null,null,null,null,null,null," "]
[null,null,null,null,null,{"$f":"IF(E860=\"\",\"\",IF(COUNTIF(E$6:E859,E860)<1,\"初\",IFERROR(VLOOKUP(INDEX(F$1:F859,_xlfn.AGGREGATE(14,6,ROW(E$6:E859)/(E$6:E859=E860),1)),{\"申\",\"　\";\"　\",\"申\"},2,0),\"\")))","v":""},null,null,null,null,null,null,null,null," "]
[null,null,null,null,null,{"$f":"IF(E861=\"\",\"\",IF(COUNTIF(E$6:E860,E861)<1,\"初\",IFERROR(VLOOKUP(INDEX(F$1:F860,_xlfn.AGGREGATE(14,6,ROW(E$6:E860)/(E$6:E860=E861),1)),{\"申\",\"　\";\"　\",\"申\"},2,0),\"\")))","v":""},null,null,null,null,null,null,null,null," "]
[null,null,null,null,null,{"$f":"IF(E862=\"\",\"\",IF(COUNTIF(E$6:E861,E862)<1,\"初\",IFERROR(VLOOKUP(INDEX(F$1:F861,_xlfn.AGGREGATE(14,6,ROW(E$6:E861)/(E$6:E861=E862),1)),{\"申\",\"　\";\"　\",\"申\"},2,0),\"\")))","v":""},null,null,null,null,null,null,null,null," "]
[null,null,null,null,null,{"$f":"IF(E863=\"\",\"\",IF(COUNTIF(E$6:E862,E863)<1,\"初\",IFERROR(VLOOKUP(INDEX(F$1:F862,_xlfn.AGGREGATE(14,6,ROW(E$6:E862)/(E$6:E862=E863),1)),{\"申\",\"　\";\"　\",\"申\"},2,0),\"\")))","v":""},null,null,null,null,null,null,null,null,{"$f":"IF(ISERROR(LEFT(E863,FIND(\"　\",E863,1)-1)&\" \"&LEFT(G863,FIND(\"　\",G863,1)-1)&\" \"&K863&L863&\" \"&H863&IF(I863<>\"\",\"or\"&I863,\"\")&J863&M863&N863), \"\", LEFT(E863,FIND(\"　\",E863,1)-1)&\" \"&LEFT(G863,FIND(\"　\",G863,1)-1)&\" \"&K863&L863&\" \"&H863&IF(I863<>\"\",\"or\"&I863,\"\")&J863&M863&N863)&\" \"&F863","v":" "}]
[null,null,null,null,null,{"$f":"IF(E864=\"\",\"\",IF(COUNTIF(E$6:E863,E864)<1,\"初\",IFERROR(VLOOKUP(INDEX(F$1:F863,_xlfn.AGGREGATE(14,6,ROW(E$6:E863)/(E$6:E863=E864),1)),{\"申\",\"　\";\"　\",\"申\"},2,0),\"\")))","v":""},null,null,null,null,null,null,null,null," "]
[null,null,null,null,null,{"$f":"IF(E865=\"\",\"\",IF(COUNTIF(E$6:E864,E865)<1,\"初\",IFERROR(VLOOKUP(INDEX(F$1:F864,_xlfn.AGGREGATE(14,6,ROW(E$6:E864)/(E$6:E864=E865),1)),{\"申\",\"　\";\"　\",\"申\"},2,0),\"\")))","v":""},null,null,null,null,null,null,null,null," "]
[null,null,null,null,null,{"$f":"IF(E866=\"\",\"\",IF(COUNTIF(E$6:E865,E866)<1,\"初\",IFERROR(VLOOKUP(INDEX(F$1:F865,_xlfn.AGGREGATE(14,6,ROW(E$6:E865)/(E$6:E865=E866),1)),{\"申\",\"　\";\"　\",\"申\"},2,0),\"\")))","v":""},null,null,null,null,null,null,null,null," "]
[null,null,null,null,null,{"$f":"IF(E867=\"\",\"\",IF(COUNTIF(E$6:E866,E867)<1,\"初\",IFERROR(VLOOKUP(INDEX(F$1:F866,_xlfn.AGGREGATE(14,6,ROW(E$6:E866)/(E$6:E866=E867),1)),{\"申\",\"　\";\"　\",\"申\"},2,0),\"\")))","v":""},null,null,null,null,null,null,null,null," "]
[null,null,null,null,null,{"$f":"IF(E868=\"\",\"\",IF(COUNTIF(E$6:E867,E868)<1,\"初\",IFERROR(VLOOKUP(INDEX(F$1:F867,_xlfn.AGGREGATE(14,6,ROW(E$6:E867)/(E$6:E867=E868),1)),{\"申\",\"　\";\"　\",\"申\"},2,0),\"\")))","v":""},null,null,null,null,null,null,null,null," "]
[null,null,null,null,null,{"$f":"IF(E869=\"\",\"\",IF(COUNTIF(E$6:E868,E869)<1,\"初\",IFERROR(VLOOKUP(INDEX(F$1:F868,_xlfn.AGGREGATE(14,6,ROW(E$6:E868)/(E$6:E868=E869),1)),{\"申\",\"　\";\"　\",\"申\"},2,0),\"\")))","v":""},null,null,null,null,null,null,null,null," "]
[null,null,null,null,null,{"$f":"IF(E870=\"\",\"\",IF(COUNTIF(E$6:E869,E870)<1,\"初\",IFERROR(VLOOKUP(INDEX(F$1:F869,_xlfn.AGGREGATE(14,6,ROW(E$6:E869)/(E$6:E869=E870),1)),{\"申\",\"　\";\"　\",\"申\"},2,0),\"\")))","v":""},null,null,null,null,null,null,null,null," "]
[null,null,null,null,null,{"$f":"IF(E871=\"\",\"\",IF(COUNTIF(E$6:E870,E871)<1,\"初\",IFERROR(VLOOKUP(INDEX(F$1:F870,_xlfn.AGGREGATE(14,6,ROW(E$6:E870)/(E$6:E870=E871),1)),{\"申\",\"　\";\"　\",\"申\"},2,0),\"\")))","v":""},null,null,null,null,null,null,null,null," "]
[null,null,null,null,null,{"$f":"IF(E872=\"\",\"\",IF(COUNTIF(E$6:E871,E872)<1,\"初\",IFERROR(VLOOKUP(INDEX(F$1:F871,_xlfn.AGGREGATE(14,6,ROW(E$6:E871)/(E$6:E871=E872),1)),{\"申\",\"　\";\"　\",\"申\"},2,0),\"\")))","v":""},null,null,null,null,null,null,null,null," "]
[null,null,null,null,null,{"$f":"IF(E873=\"\",\"\",IF(COUNTIF(E$6:E872,E873)<1,\"初\",IFERROR(VLOOKUP(INDEX(F$1:F872,_xlfn.AGGREGATE(14,6,ROW(E$6:E872)/(E$6:E872=E873),1)),{\"申\",\"　\";\"　\",\"申\"},2,0),\"\")))","v":""},null,null,null,null,null,null,null,null," "]
[null,null,null,null,null,{"$f":"IF(E874=\"\",\"\",IF(COUNTIF(E$6:E873,E874)<1,\"初\",IFERROR(VLOOKUP(INDEX(F$1:F873,_xlfn.AGGREGATE(14,6,ROW(E$6:E873)/(E$6:E873=E874),1)),{\"申\",\"　\";\"　\",\"申\"},2,0),\"\")))","v":""},null,null,null,null,null,null,null,null," "]
[null,null,null,null,null,{"$f":"IF(E875=\"\",\"\",IF(COUNTIF(E$6:E874,E875)<1,\"初\",IFERROR(VLOOKUP(INDEX(F$1:F874,_xlfn.AGGREGATE(14,6,ROW(E$6:E874)/(E$6:E874=E875),1)),{\"申\",\"　\";\"　\",\"申\"},2,0),\"\")))","v":""},null,null,null,null,null,null,null,null," "]
[null,null,null,null,null,{"$f":"IF(E876=\"\",\"\",IF(COUNTIF(E$6:E875,E876)<1,\"初\",IFERROR(VLOOKUP(INDEX(F$1:F875,_xlfn.AGGREGATE(14,6,ROW(E$6:E875)/(E$6:E875=E876),1)),{\"申\",\"　\";\"　\",\"申\"},2,0),\"\")))","v":""},null,null,null,null,null,null,null,null," "]
[null,null,null,null,null,{"$f":"IF(E877=\"\",\"\",IF(COUNTIF(E$6:E876,E877)<1,\"初\",IFERROR(VLOOKUP(INDEX(F$1:F876,_xlfn.AGGREGATE(14,6,ROW(E$6:E876)/(E$6:E876=E877),1)),{\"申\",\"　\";\"　\",\"申\"},2,0),\"\")))","v":""},null,null,null,null,null,null,null,null," "]
[null,null,null,null,null,{"$f":"IF(E878=\"\",\"\",IF(COUNTIF(E$6:E877,E878)<1,\"初\",IFERROR(VLOOKUP(INDEX(F$1:F877,_xlfn.AGGREGATE(14,6,ROW(E$6:E877)/(E$6:E877=E878),1)),{\"申\",\"　\";\"　\",\"申\"},2,0),\"\")))","v":""},null,null,null,null,null,null,null,null," "]
[null,null,null,null,null,{"$f":"IF(E879=\"\",\"\",IF(COUNTIF(E$6:E878,E879)<1,\"初\",IFERROR(VLOOKUP(INDEX(F$1:F878,_xlfn.AGGREGATE(14,6,ROW(E$6:E878)/(E$6:E878=E879),1)),{\"申\",\"　\";\"　\",\"申\"},2,0),\"\")))","v":""},null,null,null,null,null,null,null,null," "]
[null,null,null,null,null,{"$f":"IF(E880=\"\",\"\",IF(COUNTIF(E$6:E879,E880)<1,\"初\",IFERROR(VLOOKUP(INDEX(F$1:F879,_xlfn.AGGREGATE(14,6,ROW(E$6:E879)/(E$6:E879=E880),1)),{\"申\",\"　\";\"　\",\"申\"},2,0),\"\")))","v":""},null,null,null,null,null,null,null,null," "]
[null,null,null,null,null,{"$f":"IF(E881=\"\",\"\",IF(COUNTIF(E$6:E880,E881)<1,\"初\",IFERROR(VLOOKUP(INDEX(F$1:F880,_xlfn.AGGREGATE(14,6,ROW(E$6:E880)/(E$6:E880=E881),1)),{\"申\",\"　\";\"　\",\"申\"},2,0),\"\")))","v":""},null,null,null,null,null,null,null,null," "]
[null,null,null,null,null,{"$f":"IF(E882=\"\",\"\",IF(COUNTIF(E$6:E881,E882)<1,\"初\",IFERROR(VLOOKUP(INDEX(F$1:F881,_xlfn.AGGREGATE(14,6,ROW(E$6:E881)/(E$6:E881=E882),1)),{\"申\",\"　\";\"　\",\"申\"},2,0),\"\")))","v":""},null,null,null,null,null,null,null,null," "]
[null,null,null,null,null,{"$f":"IF(E883=\"\",\"\",IF(COUNTIF(E$6:E882,E883)<1,\"初\",IFERROR(VLOOKUP(INDEX(F$1:F882,_xlfn.AGGREGATE(14,6,ROW(E$6:E882)/(E$6:E882=E883),1)),{\"申\",\"　\";\"　\",\"申\"},2,0),\"\")))","v":""},null,null,null,null,null,null,null,null," "]
[null,null,null,null,null,{"$f":"IF(E884=\"\",\"\",IF(COUNTIF(E$6:E883,E884)<1,\"初\",IFERROR(VLOOKUP(INDEX(F$1:F883,_xlfn.AGGREGATE(14,6,ROW(E$6:E883)/(E$6:E883=E884),1)),{\"申\",\"　\";\"　\",\"申\"},2,0),\"\")))","v":""},null,null,null,null,null,null,null,null," "]
[null,null,null,null,null,{"$f":"IF(E885=\"\",\"\",IF(COUNTIF(E$6:E884,E885)<1,\"初\",IFERROR(VLOOKUP(INDEX(F$1:F884,_xlfn.AGGREGATE(14,6,ROW(E$6:E884)/(E$6:E884=E885),1)),{\"申\",\"　\";\"　\",\"申\"},2,0),\"\")))","v":""},null,null,null,null,null,null,null,null," "]
[null,null,null,null,null,{"$f":"IF(E886=\"\",\"\",IF(COUNTIF(E$6:E885,E886)<1,\"初\",IFERROR(VLOOKUP(INDEX(F$1:F885,_xlfn.AGGREGATE(14,6,ROW(E$6:E885)/(E$6:E885=E886),1)),{\"申\",\"　\";\"　\",\"申\"},2,0),\"\")))","v":""},null,null,null,null,null,null,null,null," "]
[null,null,null,null,null,{"$f":"IF(E887=\"\",\"\",IF(COUNTIF(E$6:E886,E887)<1,\"初\",IFERROR(VLOOKUP(INDEX(F$1:F886,_xlfn.AGGREGATE(14,6,ROW(E$6:E886)/(E$6:E886=E887),1)),{\"申\",\"　\";\"　\",\"申\"},2,0),\"\")))","v":""},null,null,null,null,null,null,null,null," "]
[null,null,null,null,null,{"$f":"IF(E888=\"\",\"\",IF(COUNTIF(E$6:E887,E888)<1,\"初\",IFERROR(VLOOKUP(INDEX(F$1:F887,_xlfn.AGGREGATE(14,6,ROW(E$6:E887)/(E$6:E887=E888),1)),{\"申\",\"　\";\"　\",\"申\"},2,0),\"\")))","v":""},null,null,null,null,null,null,null,null," "]
[null,null,null,null,null,{"$f":"IF(E889=\"\",\"\",IF(COUNTIF(E$6:E888,E889)<1,\"初\",IFERROR(VLOOKUP(INDEX(F$1:F888,_xlfn.AGGREGATE(14,6,ROW(E$6:E888)/(E$6:E888=E889),1)),{\"申\",\"　\";\"　\",\"申\"},2,0),\"\")))","v":""},null,null,null,null,null,null,null,null," "]
[null,null,null,null,null,{"$f":"IF(E890=\"\",\"\",IF(COUNTIF(E$6:E889,E890)<1,\"初\",IFERROR(VLOOKUP(INDEX(F$1:F889,_xlfn.AGGREGATE(14,6,ROW(E$6:E889)/(E$6:E889=E890),1)),{\"申\",\"　\";\"　\",\"申\"},2,0),\"\")))","v":""},null,null,null,null,null,null,null,null," "]
[null,null,null,null,null,{"$f":"IF(E891=\"\",\"\",IF(COUNTIF(E$6:E890,E891)<1,\"初\",IFERROR(VLOOKUP(INDEX(F$1:F890,_xlfn.AGGREGATE(14,6,ROW(E$6:E890)/(E$6:E890=E891),1)),{\"申\",\"　\";\"　\",\"申\"},2,0),\"\")))","v":""},null,null,null,null,null,null,null,null," "]
[null,null,null,null,null,{"$f":"IF(E892=\"\",\"\",IF(COUNTIF(E$6:E891,E892)<1,\"初\",IFERROR(VLOOKUP(INDEX(F$1:F891,_xlfn.AGGREGATE(14,6,ROW(E$6:E891)/(E$6:E891=E892),1)),{\"申\",\"　\";\"　\",\"申\"},2,0),\"\")))","v":""},null,null,null,null,null,null,null,null," "]
[null,null,null,null,null,{"$f":"IF(E893=\"\",\"\",IF(COUNTIF(E$6:E892,E893)<1,\"初\",IFERROR(VLOOKUP(INDEX(F$1:F892,_xlfn.AGGREGATE(14,6,ROW(E$6:E892)/(E$6:E892=E893),1)),{\"申\",\"　\";\"　\",\"申\"},2,0),\"\")))","v":""},null,null,null,null,null,null,null,null," "]
[null,null,null,null,null,{"$f":"IF(E894=\"\",\"\",IF(COUNTIF(E$6:E893,E894)<1,\"初\",IFERROR(VLOOKUP(INDEX(F$1:F893,_xlfn.AGGREGATE(14,6,ROW(E$6:E893)/(E$6:E893=E894),1)),{\"申\",\"　\";\"　\",\"申\"},2,0),\"\")))","v":""},null,null,null,null,null,null,null,null," "]
[null,null,null,null,null,{"$f":"IF(E895=\"\",\"\",IF(COUNTIF(E$6:E894,E895)<1,\"初\",IFERROR(VLOOKUP(INDEX(F$1:F894,_xlfn.AGGREGATE(14,6,ROW(E$6:E894)/(E$6:E894=E895),1)),{\"申\",\"　\";\"　\",\"申\"},2,0),\"\")))","v":""},null,null,null,null,null,null,null,null," "]
[null,null,null,null,null,{"$f":"IF(E896=\"\",\"\",IF(COUNTIF(E$6:E895,E896)<1,\"初\",IFERROR(VLOOKUP(INDEX(F$1:F895,_xlfn.AGGREGATE(14,6,ROW(E$6:E895)/(E$6:E895=E896),1)),{\"申\",\"　\";\"　\",\"申\"},2,0),\"\")))","v":""},null,null,null,null,null,null,null,null," "]
[null,null,null,null,null,{"$f":"IF(E897=\"\",\"\",IF(COUNTIF(E$6:E896,E897)<1,\"初\",IFERROR(VLOOKUP(INDEX(F$1:F896,_xlfn.AGGREGATE(14,6,ROW(E$6:E896)/(E$6:E896=E897),1)),{\"申\",\"　\";\"　\",\"申\"},2,0),\"\")))","v":""},null,null,null,null,null,null,null,null," "]
[null,null,null,null,null,{"$f":"IF(E898=\"\",\"\",IF(COUNTIF(E$6:E897,E898)<1,\"初\",IFERROR(VLOOKUP(INDEX(F$1:F897,_xlfn.AGGREGATE(14,6,ROW(E$6:E897)/(E$6:E897=E898),1)),{\"申\",\"　\";\"　\",\"申\"},2,0),\"\")))","v":""},null,null,null,null,null,null,null,null," "]
[null,null,null,null,null,{"$f":"IF(E899=\"\",\"\",IF(COUNTIF(E$6:E898,E899)<1,\"初\",IFERROR(VLOOKUP(INDEX(F$1:F898,_xlfn.AGGREGATE(14,6,ROW(E$6:E898)/(E$6:E898=E899),1)),{\"申\",\"　\";\"　\",\"申\"},2,0),\"\")))","v":""},null,null,null,null,null,null,null,null," "]
[null,null,null,null,null,{"$f":"IF(E900=\"\",\"\",IF(COUNTIF(E$6:E899,E900)<1,\"初\",IFERROR(VLOOKUP(INDEX(F$1:F899,_xlfn.AGGREGATE(14,6,ROW(E$6:E899)/(E$6:E899=E900),1)),{\"申\",\"　\";\"　\",\"申\"},2,0),\"\")))","v":""},null,null,null,null,null,null,null,null," "]
[null,null,null,null,null,{"$f":"IF(E901=\"\",\"\",IF(COUNTIF(E$6:E900,E901)<1,\"初\",IFERROR(VLOOKUP(INDEX(F$1:F900,_xlfn.AGGREGATE(14,6,ROW(E$6:E900)/(E$6:E900=E901),1)),{\"申\",\"　\";\"　\",\"申\"},2,0),\"\")))","v":""},null,null,null,null,null,null,null,null," "]
[null,null,null,null,null,{"$f":"IF(E902=\"\",\"\",IF(COUNTIF(E$6:E901,E902)<1,\"初\",IFERROR(VLOOKUP(INDEX(F$1:F901,_xlfn.AGGREGATE(14,6,ROW(E$6:E901)/(E$6:E901=E902),1)),{\"申\",\"　\";\"　\",\"申\"},2,0),\"\")))","v":""},null,null,null,null,null,null,null,null," "]
[null,null,null,null,null,{"$f":"IF(E903=\"\",\"\",IF(COUNTIF(E$6:E902,E903)<1,\"初\",IFERROR(VLOOKUP(INDEX(F$1:F902,_xlfn.AGGREGATE(14,6,ROW(E$6:E902)/(E$6:E902=E903),1)),{\"申\",\"　\";\"　\",\"申\"},2,0),\"\")))","v":""},null,null,null,null,null,null,null,null," "]
[null,null,null,null,null,{"$f":"IF(E904=\"\",\"\",IF(COUNTIF(E$6:E903,E904)<1,\"初\",IFERROR(VLOOKUP(INDEX(F$1:F903,_xlfn.AGGREGATE(14,6,ROW(E$6:E903)/(E$6:E903=E904),1)),{\"申\",\"　\";\"　\",\"申\"},2,0),\"\")))","v":""},null,null,null,null,null,null,null,null," "]
[null,null,null,null,null,{"$f":"IF(E905=\"\",\"\",IF(COUNTIF(E$6:E904,E905)<1,\"初\",IFERROR(VLOOKUP(INDEX(F$1:F904,_xlfn.AGGREGATE(14,6,ROW(E$6:E904)/(E$6:E904=E905),1)),{\"申\",\"　\";\"　\",\"申\"},2,0),\"\")))","v":""},null,null,null,null,null,null,null,null," "]
[null,null,null,null,null,{"$f":"IF(E906=\"\",\"\",IF(COUNTIF(E$6:E905,E906)<1,\"初\",IFERROR(VLOOKUP(INDEX(F$1:F905,_xlfn.AGGREGATE(14,6,ROW(E$6:E905)/(E$6:E905=E906),1)),{\"申\",\"　\";\"　\",\"申\"},2,0),\"\")))","v":""},null,null,null,null,null,null,null,null," "]
[null,null,null,null,null,{"$f":"IF(E907=\"\",\"\",IF(COUNTIF(E$6:E906,E907)<1,\"初\",IFERROR(VLOOKUP(INDEX(F$1:F906,_xlfn.AGGREGATE(14,6,ROW(E$6:E906)/(E$6:E906=E907),1)),{\"申\",\"　\";\"　\",\"申\"},2,0),\"\")))","v":""},null,null,null,null,null,null,null,null," "]
[null,null,null,null,null,{"$f":"IF(E908=\"\",\"\",IF(COUNTIF(E$6:E907,E908)<1,\"初\",IFERROR(VLOOKUP(INDEX(F$1:F907,_xlfn.AGGREGATE(14,6,ROW(E$6:E907)/(E$6:E907=E908),1)),{\"申\",\"　\";\"　\",\"申\"},2,0),\"\")))","v":""},null,null,null,null,null,null,null,null," "]
[null,null,null,null,null,{"$f":"IF(E909=\"\",\"\",IF(COUNTIF(E$6:E908,E909)<1,\"初\",IFERROR(VLOOKUP(INDEX(F$1:F908,_xlfn.AGGREGATE(14,6,ROW(E$6:E908)/(E$6:E908=E909),1)),{\"申\",\"　\";\"　\",\"申\"},2,0),\"\")))","v":""},null,null,null,null,null,null,null,null," "]
[null,null,null,null,null,{"$f":"IF(E910=\"\",\"\",IF(COUNTIF(E$6:E909,E910)<1,\"初\",IFERROR(VLOOKUP(INDEX(F$1:F909,_xlfn.AGGREGATE(14,6,ROW(E$6:E909)/(E$6:E909=E910),1)),{\"申\",\"　\";\"　\",\"申\"},2,0),\"\")))","v":""},null,null,null,null,null,null,null,null," "]
[null,null,null,null,null,{"$f":"IF(E911=\"\",\"\",IF(COUNTIF(E$6:E910,E911)<1,\"初\",IFERROR(VLOOKUP(INDEX(F$1:F910,_xlfn.AGGREGATE(14,6,ROW(E$6:E910)/(E$6:E910=E911),1)),{\"申\",\"　\";\"　\",\"申\"},2,0),\"\")))","v":""},null,null,null,null,null,null,null,null," "]
[null,null,null,null,null,{"$f":"IF(E912=\"\",\"\",IF(COUNTIF(E$6:E911,E912)<1,\"初\",IFERROR(VLOOKUP(INDEX(F$1:F911,_xlfn.AGGREGATE(14,6,ROW(E$6:E911)/(E$6:E911=E912),1)),{\"申\",\"　\";\"　\",\"申\"},2,0),\"\")))","v":""},null,null,null,null,null,null,null,null," "]
[null,null,null,null,null,{"$f":"IF(E913=\"\",\"\",IF(COUNTIF(E$6:E912,E913)<1,\"初\",IFERROR(VLOOKUP(INDEX(F$1:F912,_xlfn.AGGREGATE(14,6,ROW(E$6:E912)/(E$6:E912=E913),1)),{\"申\",\"　\";\"　\",\"申\"},2,0),\"\")))","v":""},null,null,null,null,null,null,null,null," "]
[null,null,null,null,null,{"$f":"IF(E914=\"\",\"\",IF(COUNTIF(E$6:E913,E914)<1,\"初\",IFERROR(VLOOKUP(INDEX(F$1:F913,_xlfn.AGGREGATE(14,6,ROW(E$6:E913)/(E$6:E913=E914),1)),{\"申\",\"　\";\"　\",\"申\"},2,0),\"\")))","v":""},null,null,null,null,null,null,null,null," "]
[null,null,null,null,null,{"$f":"IF(E915=\"\",\"\",IF(COUNTIF(E$6:E914,E915)<1,\"初\",IFERROR(VLOOKUP(INDEX(F$1:F914,_xlfn.AGGREGATE(14,6,ROW(E$6:E914)/(E$6:E914=E915),1)),{\"申\",\"　\";\"　\",\"申\"},2,0),\"\")))","v":""},null,null,null,null,null,null,null,null," "]
[null,null,null,null,null,{"$f":"IF(E916=\"\",\"\",IF(COUNTIF(E$6:E915,E916)<1,\"初\",IFERROR(VLOOKUP(INDEX(F$1:F915,_xlfn.AGGREGATE(14,6,ROW(E$6:E915)/(E$6:E915=E916),1)),{\"申\",\"　\";\"　\",\"申\"},2,0),\"\")))","v":""},null,null,null,null,null,null,null,null," "]
[null,null,null,null,null,{"$f":"IF(E917=\"\",\"\",IF(COUNTIF(E$6:E916,E917)<1,\"初\",IFERROR(VLOOKUP(INDEX(F$1:F916,_xlfn.AGGREGATE(14,6,ROW(E$6:E916)/(E$6:E916=E917),1)),{\"申\",\"　\";\"　\",\"申\"},2,0),\"\")))","v":""},null,null,null,null,null,null,null,null," "]
[null,null,null,null,null,{"$f":"IF(E918=\"\",\"\",IF(COUNTIF(E$6:E917,E918)<1,\"初\",IFERROR(VLOOKUP(INDEX(F$1:F917,_xlfn.AGGREGATE(14,6,ROW(E$6:E917)/(E$6:E917=E918),1)),{\"申\",\"　\";\"　\",\"申\"},2,0),\"\")))","v":""},null,null,null,null,null,null,null,null," "]
[null,null,null,null,null,{"$f":"IF(E919=\"\",\"\",IF(COUNTIF(E$6:E918,E919)<1,\"初\",IFERROR(VLOOKUP(INDEX(F$1:F918,_xlfn.AGGREGATE(14,6,ROW(E$6:E918)/(E$6:E918=E919),1)),{\"申\",\"　\";\"　\",\"申\"},2,0),\"\")))","v":""},null,null,null,null,null,null,null,null," "]
[null,null,null,null,null,{"$f":"IF(E920=\"\",\"\",IF(COUNTIF(E$6:E919,E920)<1,\"初\",IFERROR(VLOOKUP(INDEX(F$1:F919,_xlfn.AGGREGATE(14,6,ROW(E$6:E919)/(E$6:E919=E920),1)),{\"申\",\"　\";\"　\",\"申\"},2,0),\"\")))","v":""},null,null,null,null,null,null,null,null," "]
[null,null,null,null,null,{"$f":"IF(E921=\"\",\"\",IF(COUNTIF(E$6:E920,E921)<1,\"初\",IFERROR(VLOOKUP(INDEX(F$1:F920,_xlfn.AGGREGATE(14,6,ROW(E$6:E920)/(E$6:E920=E921),1)),{\"申\",\"　\";\"　\",\"申\"},2,0),\"\")))","v":""},null,null,null,null,null,null,null,null," "]
[null,null,null,null,null,{"$f":"IF(E922=\"\",\"\",IF(COUNTIF(E$6:E921,E922)<1,\"初\",IFERROR(VLOOKUP(INDEX(F$1:F921,_xlfn.AGGREGATE(14,6,ROW(E$6:E921)/(E$6:E921=E922),1)),{\"申\",\"　\";\"　\",\"申\"},2,0),\"\")))","v":""},null,null,null,null,null,null,null,null," "]
[null,null,null,null,null,{"$f":"IF(E923=\"\",\"\",IF(COUNTIF(E$6:E922,E923)<1,\"初\",IFERROR(VLOOKUP(INDEX(F$1:F922,_xlfn.AGGREGATE(14,6,ROW(E$6:E922)/(E$6:E922=E923),1)),{\"申\",\"　\";\"　\",\"申\"},2,0),\"\")))","v":""},null,null,null,null,null,null,null,null," "]
[null,null,null,null,null,{"$f":"IF(E924=\"\",\"\",IF(COUNTIF(E$6:E923,E924)<1,\"初\",IFERROR(VLOOKUP(INDEX(F$1:F923,_xlfn.AGGREGATE(14,6,ROW(E$6:E923)/(E$6:E923=E924),1)),{\"申\",\"　\";\"　\",\"申\"},2,0),\"\")))","v":""},null,null,null,null,null,null,null,null," "]
[null,null,null,null,null,{"$f":"IF(E925=\"\",\"\",IF(COUNTIF(E$6:E924,E925)<1,\"初\",IFERROR(VLOOKUP(INDEX(F$1:F924,_xlfn.AGGREGATE(14,6,ROW(E$6:E924)/(E$6:E924=E925),1)),{\"申\",\"　\";\"　\",\"申\"},2,0),\"\")))","v":""},null,null,null,null,null,null,null,null," "]
[null,null,null,null,null,{"$f":"IF(E926=\"\",\"\",IF(COUNTIF(E$6:E925,E926)<1,\"初\",IFERROR(VLOOKUP(INDEX(F$1:F925,_xlfn.AGGREGATE(14,6,ROW(E$6:E925)/(E$6:E925=E926),1)),{\"申\",\"　\";\"　\",\"申\"},2,0),\"\")))","v":""},null,null,null,null,null,null,null,null," "]
[null,null,null,null,null,{"$f":"IF(E927=\"\",\"\",IF(COUNTIF(E$6:E926,E927)<1,\"初\",IFERROR(VLOOKUP(INDEX(F$1:F926,_xlfn.AGGREGATE(14,6,ROW(E$6:E926)/(E$6:E926=E927),1)),{\"申\",\"　\";\"　\",\"申\"},2,0),\"\")))","v":""},null,null,null,null,null,null,null,null,{"$f":"IF(ISERROR(LEFT(E927,FIND(\"　\",E927,1)-1)&\" \"&LEFT(G927,FIND(\"　\",G927,1)-1)&\" \"&K927&L927&\" \"&H927&IF(I927<>\"\",\"or\"&I927,\"\")&J927&M927&N927), \"\", LEFT(E927,FIND(\"　\",E927,1)-1)&\" \"&LEFT(G927,FIND(\"　\",G927,1)-1)&\" \"&K927&L927&\" \"&H927&IF(I927<>\"\",\"or\"&I927,\"\")&J927&M927&N927)&\" \"&F927","v":" "}]
[null,null,null,null,null,{"$f":"IF(E928=\"\",\"\",IF(COUNTIF(E$6:E927,E928)<1,\"初\",IFERROR(VLOOKUP(INDEX(F$1:F927,_xlfn.AGGREGATE(14,6,ROW(E$6:E927)/(E$6:E927=E928),1)),{\"申\",\"　\";\"　\",\"申\"},2,0),\"\")))","v":""},null,null,null,null,null,null,null,null," "]
[null,null,null,null,null,{"$f":"IF(E929=\"\",\"\",IF(COUNTIF(E$6:E928,E929)<1,\"初\",IFERROR(VLOOKUP(INDEX(F$1:F928,_xlfn.AGGREGATE(14,6,ROW(E$6:E928)/(E$6:E928=E929),1)),{\"申\",\"　\";\"　\",\"申\"},2,0),\"\")))","v":""},null,null,null,null,null,null,null,null," "]
[null,null,null,null,null,{"$f":"IF(E930=\"\",\"\",IF(COUNTIF(E$6:E929,E930)<1,\"初\",IFERROR(VLOOKUP(INDEX(F$1:F929,_xlfn.AGGREGATE(14,6,ROW(E$6:E929)/(E$6:E929=E930),1)),{\"申\",\"　\";\"　\",\"申\"},2,0),\"\")))","v":""},null,null,null,null,null,null,null,null," "]
[null,null,null,null,null,{"$f":"IF(E931=\"\",\"\",IF(COUNTIF(E$6:E930,E931)<1,\"初\",IFERROR(VLOOKUP(INDEX(F$1:F930,_xlfn.AGGREGATE(14,6,ROW(E$6:E930)/(E$6:E930=E931),1)),{\"申\",\"　\";\"　\",\"申\"},2,0),\"\")))","v":""},null,null,null,null,null,null,null,null," "]
[null,null,null,null,null,{"$f":"IF(E932=\"\",\"\",IF(COUNTIF(E$6:E931,E932)<1,\"初\",IFERROR(VLOOKUP(INDEX(F$1:F931,_xlfn.AGGREGATE(14,6,ROW(E$6:E931)/(E$6:E931=E932),1)),{\"申\",\"　\";\"　\",\"申\"},2,0),\"\")))","v":""},null,null,null,null,null,null,null,null," "]
[null,null,null,null,null,{"$f":"IF(E933=\"\",\"\",IF(COUNTIF(E$6:E932,E933)<1,\"初\",IFERROR(VLOOKUP(INDEX(F$1:F932,_xlfn.AGGREGATE(14,6,ROW(E$6:E932)/(E$6:E932=E933),1)),{\"申\",\"　\";\"　\",\"申\"},2,0),\"\")))","v":""},null,null,null,null,null,null,null,null," "]
[null,null,null,null,null,{"$f":"IF(E934=\"\",\"\",IF(COUNTIF(E$6:E933,E934)<1,\"初\",IFERROR(VLOOKUP(INDEX(F$1:F933,_xlfn.AGGREGATE(14,6,ROW(E$6:E933)/(E$6:E933=E934),1)),{\"申\",\"　\";\"　\",\"申\"},2,0),\"\")))","v":""},null,null,null,null,null,null,null,null," "]
[null,null,null,null,null,{"$f":"IF(E935=\"\",\"\",IF(COUNTIF(E$6:E934,E935)<1,\"初\",IFERROR(VLOOKUP(INDEX(F$1:F934,_xlfn.AGGREGATE(14,6,ROW(E$6:E934)/(E$6:E934=E935),1)),{\"申\",\"　\";\"　\",\"申\"},2,0),\"\")))","v":""},null,null,null,null,null,null,null,null," "]
[null,null,null,null,null,{"$f":"IF(E936=\"\",\"\",IF(COUNTIF(E$6:E935,E936)<1,\"初\",IFERROR(VLOOKUP(INDEX(F$1:F935,_xlfn.AGGREGATE(14,6,ROW(E$6:E935)/(E$6:E935=E936),1)),{\"申\",\"　\";\"　\",\"申\"},2,0),\"\")))","v":""},null,null,null,null,null,null,null,null," "]
[null,null,null,null,null,{"$f":"IF(E937=\"\",\"\",IF(COUNTIF(E$6:E936,E937)<1,\"初\",IFERROR(VLOOKUP(INDEX(F$1:F936,_xlfn.AGGREGATE(14,6,ROW(E$6:E936)/(E$6:E936=E937),1)),{\"申\",\"　\";\"　\",\"申\"},2,0),\"\")))","v":""},null,null,null,null,null,null,null,null," "]
[null,null,null,null,null,{"$f":"IF(E938=\"\",\"\",IF(COUNTIF(E$6:E937,E938)<1,\"初\",IFERROR(VLOOKUP(INDEX(F$1:F937,_xlfn.AGGREGATE(14,6,ROW(E$6:E937)/(E$6:E937=E938),1)),{\"申\",\"　\";\"　\",\"申\"},2,0),\"\")))","v":""},null,null,null,null,null,null,null,null," "]
[null,null,null,null,null,{"$f":"IF(E939=\"\",\"\",IF(COUNTIF(E$6:E938,E939)<1,\"初\",IFERROR(VLOOKUP(INDEX(F$1:F938,_xlfn.AGGREGATE(14,6,ROW(E$6:E938)/(E$6:E938=E939),1)),{\"申\",\"　\";\"　\",\"申\"},2,0),\"\")))","v":""},null,null,null,null,null,null,null,null," "]
[null,null,null,null,null,{"$f":"IF(E940=\"\",\"\",IF(COUNTIF(E$6:E939,E940)<1,\"初\",IFERROR(VLOOKUP(INDEX(F$1:F939,_xlfn.AGGREGATE(14,6,ROW(E$6:E939)/(E$6:E939=E940),1)),{\"申\",\"　\";\"　\",\"申\"},2,0),\"\")))","v":""},null,null,null,null,null,null,null,null," "]
[null,null,null,null,null,{"$f":"IF(E941=\"\",\"\",IF(COUNTIF(E$6:E940,E941)<1,\"初\",IFERROR(VLOOKUP(INDEX(F$1:F940,_xlfn.AGGREGATE(14,6,ROW(E$6:E940)/(E$6:E940=E941),1)),{\"申\",\"　\";\"　\",\"申\"},2,0),\"\")))","v":""},null,null,null,null,null,null,null,null," "]
[null,null,null,null,null,{"$f":"IF(E942=\"\",\"\",IF(COUNTIF(E$6:E941,E942)<1,\"初\",IFERROR(VLOOKUP(INDEX(F$1:F941,_xlfn.AGGREGATE(14,6,ROW(E$6:E941)/(E$6:E941=E942),1)),{\"申\",\"　\";\"　\",\"申\"},2,0),\"\")))","v":""},null,null,null,null,null,null,null,null," "]
[null,null,null,null,null,{"$f":"IF(E943=\"\",\"\",IF(COUNTIF(E$6:E942,E943)<1,\"初\",IFERROR(VLOOKUP(INDEX(F$1:F942,_xlfn.AGGREGATE(14,6,ROW(E$6:E942)/(E$6:E942=E943),1)),{\"申\",\"　\";\"　\",\"申\"},2,0),\"\")))","v":""},null,null,null,null,null,null,null,null," "]
[null,null,null,null,null,{"$f":"IF(E944=\"\",\"\",IF(COUNTIF(E$6:E943,E944)<1,\"初\",IFERROR(VLOOKUP(INDEX(F$1:F943,_xlfn.AGGREGATE(14,6,ROW(E$6:E943)/(E$6:E943=E944),1)),{\"申\",\"　\";\"　\",\"申\"},2,0),\"\")))","v":""},null,null,null,null,null,null,null,null," "]
[null,null,null,null,null,{"$f":"IF(E945=\"\",\"\",IF(COUNTIF(E$6:E944,E945)<1,\"初\",IFERROR(VLOOKUP(INDEX(F$1:F944,_xlfn.AGGREGATE(14,6,ROW(E$6:E944)/(E$6:E944=E945),1)),{\"申\",\"　\";\"　\",\"申\"},2,0),\"\")))","v":""},null,null,null,null,null,null,null,null," "]
[null,null,null,null,null,{"$f":"IF(E946=\"\",\"\",IF(COUNTIF(E$6:E945,E946)<1,\"初\",IFERROR(VLOOKUP(INDEX(F$1:F945,_xlfn.AGGREGATE(14,6,ROW(E$6:E945)/(E$6:E945=E946),1)),{\"申\",\"　\";\"　\",\"申\"},2,0),\"\")))","v":""},null,null,null,null,null,null,null,null," "]
[null,null,null,null,null,{"$f":"IF(E947=\"\",\"\",IF(COUNTIF(E$6:E946,E947)<1,\"初\",IFERROR(VLOOKUP(INDEX(F$1:F946,_xlfn.AGGREGATE(14,6,ROW(E$6:E946)/(E$6:E946=E947),1)),{\"申\",\"　\";\"　\",\"申\"},2,0),\"\")))","v":""},null,null,null,null,null,null,null,null," "]
[null,null,null,null,null,{"$f":"IF(E948=\"\",\"\",IF(COUNTIF(E$6:E947,E948)<1,\"初\",IFERROR(VLOOKUP(INDEX(F$1:F947,_xlfn.AGGREGATE(14,6,ROW(E$6:E947)/(E$6:E947=E948),1)),{\"申\",\"　\";\"　\",\"申\"},2,0),\"\")))","v":""},null,null,null,null,null,null,null,null," "]
[null,null,null,null,null,{"$f":"IF(E949=\"\",\"\",IF(COUNTIF(E$6:E948,E949)<1,\"初\",IFERROR(VLOOKUP(INDEX(F$1:F948,_xlfn.AGGREGATE(14,6,ROW(E$6:E948)/(E$6:E948=E949),1)),{\"申\",\"　\";\"　\",\"申\"},2,0),\"\")))","v":""},null,null,null,null,null,null,null,null," "]
[null,null,null,null,null,{"$f":"IF(E950=\"\",\"\",IF(COUNTIF(E$6:E949,E950)<1,\"初\",IFERROR(VLOOKUP(INDEX(F$1:F949,_xlfn.AGGREGATE(14,6,ROW(E$6:E949)/(E$6:E949=E950),1)),{\"申\",\"　\";\"　\",\"申\"},2,0),\"\")))","v":""},null,null,null,null,null,null,null,null," "]
[null,null,null,null,null,{"$f":"IF(E951=\"\",\"\",IF(COUNTIF(E$6:E950,E951)<1,\"初\",IFERROR(VLOOKUP(INDEX(F$1:F950,_xlfn.AGGREGATE(14,6,ROW(E$6:E950)/(E$6:E950=E951),1)),{\"申\",\"　\";\"　\",\"申\"},2,0),\"\")))","v":""},null,null,null,null,null,null,null,null," "]
[null,null,null,null,null,{"$f":"IF(E952=\"\",\"\",IF(COUNTIF(E$6:E951,E952)<1,\"初\",IFERROR(VLOOKUP(INDEX(F$1:F951,_xlfn.AGGREGATE(14,6,ROW(E$6:E951)/(E$6:E951=E952),1)),{\"申\",\"　\";\"　\",\"申\"},2,0),\"\")))","v":""},null,null,null,null,null,null,null,null," "]
[null,null,null,null,null,{"$f":"IF(E953=\"\",\"\",IF(COUNTIF(E$6:E952,E953)<1,\"初\",IFERROR(VLOOKUP(INDEX(F$1:F952,_xlfn.AGGREGATE(14,6,ROW(E$6:E952)/(E$6:E952=E953),1)),{\"申\",\"　\";\"　\",\"申\"},2,0),\"\")))","v":""},null,null,null,null,null,null,null,null," "]
[null,null,null,null,null,{"$f":"IF(E954=\"\",\"\",IF(COUNTIF(E$6:E953,E954)<1,\"初\",IFERROR(VLOOKUP(INDEX(F$1:F953,_xlfn.AGGREGATE(14,6,ROW(E$6:E953)/(E$6:E953=E954),1)),{\"申\",\"　\";\"　\",\"申\"},2,0),\"\")))","v":""},null,null,null,null,null,null,null,null," "]
[null,null,null,null,null,{"$f":"IF(E955=\"\",\"\",IF(COUNTIF(E$6:E954,E955)<1,\"初\",IFERROR(VLOOKUP(INDEX(F$1:F954,_xlfn.AGGREGATE(14,6,ROW(E$6:E954)/(E$6:E954=E955),1)),{\"申\",\"　\";\"　\",\"申\"},2,0),\"\")))","v":""},null,null,null,null,null,null,null,null," "]
[null,null,null,null,null,{"$f":"IF(E956=\"\",\"\",IF(COUNTIF(E$6:E955,E956)<1,\"初\",IFERROR(VLOOKUP(INDEX(F$1:F955,_xlfn.AGGREGATE(14,6,ROW(E$6:E955)/(E$6:E955=E956),1)),{\"申\",\"　\";\"　\",\"申\"},2,0),\"\")))","v":""}]
[null,null,null,null,null,{"$f":"IF(E957=\"\",\"\",IF(COUNTIF(E$6:E956,E957)<1,\"初\",IFERROR(VLOOKUP(INDEX(F$1:F956,_xlfn.AGGREGATE(14,6,ROW(E$6:E956)/(E$6:E956=E957),1)),{\"申\",\"　\";\"　\",\"申\"},2,0),\"\")))","v":""}]
[null,null,null,null,null,{"$f":"IF(E958=\"\",\"\",IF(COUNTIF(E$6:E957,E958)<1,\"初\",IFERROR(VLOOKUP(INDEX(F$1:F957,_xlfn.AGGREGATE(14,6,ROW(E$6:E957)/(E$6:E957=E958),1)),{\"申\",\"　\";\"　\",\"申\"},2,0),\"\")))","v":""}]
[null,null,null,null,null,{"$f":"IF(E959=\"\",\"\",IF(COUNTIF(E$6:E958,E959)<1,\"初\",IFERROR(VLOOKUP(INDEX(F$1:F958,_xlfn.AGGREGATE(14,6,ROW(E$6:E958)/(E$6:E958=E959),1)),{\"申\",\"　\";\"　\",\"申\"},2,0),\"\")))","v":""}]
[null,null,null,null,null,{"$f":"IF(E960=\"\",\"\",IF(COUNTIF(E$6:E959,E960)<1,\"初\",IFERROR(VLOOKUP(INDEX(F$1:F959,_xlfn.AGGREGATE(14,6,ROW(E$6:E959)/(E$6:E959=E960),1)),{\"申\",\"　\";\"　\",\"申\"},2,0),\"\")))","v":""}]
[null,null,null,null,null,{"$f":"IF(E961=\"\",\"\",IF(COUNTIF(E$6:E960,E961)<1,\"初\",IFERROR(VLOOKUP(INDEX(F$1:F960,_xlfn.AGGREGATE(14,6,ROW(E$6:E960)/(E$6:E960=E961),1)),{\"申\",\"　\";\"　\",\"申\"},2,0),\"\")))","v":""}]

{"sheet":"勤務合わせ","index":3,"n_rows":9,"n_cols":34,"rows_kept":9,"cut":false,"hidden":false,"merged":[]}
[]
[]
[]
[]
[null,null,{"$f":"勤務表!C3","v":"2022-12-01"},1,2,3,4,5,6,7,8,9,10,11,12,13,14,15,16,17,18,19,20,21,22,23,24,25,26,27,28,29,30,31]
[null,null,"帆花"]
[null,null,"航平"]
[null,null,"優子"]
[null,null,"嘉孝","―","公","―","―","公","公","①","―","―","有","有","公","公","〇","公","〇","―","―","公","①","〇","公","①","―","―","公","―","―","公","〇","―"]

{"sheet":"S1","index":4,"n_rows":100,"n_cols":6,"rows_kept":100,"cut":false,"hidden":false,"merged":[]}
["Subject","StartDate","StartTime","End Date","End Time","Location"]
["―/日大淵 白水   申",{"$f":"勤務合わせ!C$5","v":"2022-12-01"},{"$f":"IF(B2<>\"\",\" \",\"\")","v":" "},{"$f":"IF(B2<>\"\",B2,\"\")","v":"2022-12-01"},{"$f":"C2","v":" "}]
["―/日",{"$f":"B2+1","v":"2022-12-02"},{"$f":"IF(B3<>\"\",\" \",\"\")","v":" "},{"$f":"IF(B3<>\"\",B3,\"\")","v":"2022-12-02"}," "]
["【休/休】",{"$f":"B3+1","v":"2022-12-03"},{"$f":"IF(B4<>\"\",\" \",\"\")","v":" "},{"$f":"IF(B4<>\"\",B4,\"\")","v":"2022-12-03"}," "]
["〇/日","2022-12-04",{"$f":"IF(B5<>\"\",\" \",\"\")","v":" "},{"$f":"IF(B5<>\"\",B5,\"\")","v":"2022-12-04"}," "]
["【休/休】","2022-12-05",{"$f":"IF(B6<>\"\",\" \",\"\")","v":" "},{"$f":"IF(B6<>\"\",B6,\"\")","v":"2022-12-05"}," "]
["遅/休","2022-12-06"," ","2022-12-06"," "]
["―/日斉藤 林   　","2022-12-07"," ","2022-12-07"," "]
["―/日","2022-12-08"," ","2022-12-08"," "]
["〇/日","2022-12-09"," ","2022-12-09"," "]
["〇/日","2022-12-10"," ","2022-12-10"," "]
["〇/日","2022-12-11"," ","2022-12-11"," "]
["―/休柴田 林   申","2022-12-12"," ","2022-12-12"," "]
["―/休","2022-12-13"," ","2022-12-13"," "]
["休/日","2022-12-14"," ","2022-12-14"," "]
["休/日","2022-12-15"," ","2022-12-15"," "]
["〇/日","2022-12-16"," ","2022-12-16"," "]
["休/日","2022-12-17"," ","2022-12-17"," "]
["早/日","2022-12-18"," ","2022-12-18"," "]
["―/休斉藤 赤松   申","2022-12-19"," ","2022-12-19"," "]
["―/休","2022-12-20"," ","2022-12-20"," "]
["休/日","2022-12-21"," ","2022-12-21"," "]
["休/日","2022-12-22"," ","2022-12-22"," "]
["〇/休","2022-12-23"," ","2022-12-23"," "]
["〇/日","2022-12-24"," ","2022-12-24"," "]
["休/日","2022-12-25"," ","2022-12-25"," "]
["【有/休】","2022-12-26"," ","2022-12-26"," "]
["【休/休】","2022-12-27"," ","2022-12-27"," "]
["〇/日","2022-12-28"," ","2022-12-28"," "]
["〇/日","2022-12-29",{"$f":"IF(B30<>\"\",\" \",\"\")","v":" "},{"$f":"IF(B30<>\"\",B30,\"\")","v":"2022-12-29"}," "]
["―/日田中 工藤   申","2022-12-30",{"$f":"IF(B31<>\"\",\" \",\"\")","v":" "},{"$f":"IF(B31<>\"\",B31,\"\")","v":"2022-12-30"}," "]
["","2022-12-31",{"$f":"IF(B32<>\"\",\" \",\"\")","v":" "},{"$f":"IF(B32<>\"\",B32,\"\")","v":"2022-12-31"}," "]
[]
[]
[]
[]
[]
[]
[]
[]
[]
[]
[]
[]
[]
[]
[]
[]
[]
[]
[]
[]
[]
[]
[]
[]
[]
[]
[]
[]
[null,null,"","",{"$f":"C61","v":""}]
[null,null,"","",""]
[null,null,"","",""]
[null,null,"","",""]
[null,null,"","",""]
[null,null,"","",""]
[null,null,"","",""]
[null,null,"","",""]
[null,null,"","",""]
[null,null,{"$f":"IF(B70<>\"\",\" \",\"\")","v":""},{"$f":"IF(B70<>\"\",B70,\"\")","v":""},""]
[null,null,"","",""]
[null,null,"","",""]
[null,null,"","",""]
[null,null,"","",""]
[null,null,"","",""]
[null,null,"","",""]
[null,null,"","",""]
[null,null,"","",""]
[null,null,"","",""]
[null,null,"","",""]
[null,null,"","",""]
[null,null,"","",""]
[null,null,"","",""]
[null,null,"","",""]
[null,null,"","",""]
[null,null,"","",""]
[null,null,"","",""]
[null,null,"","",""]
[null,null,"","",""]
[null,null,"","",""]
[null,null,"","",""]
[null,null,"","",""]
[null,null,"","",""]
[null,null,"","",""]
[null,null,"","",""]
[null,null,"","",""]
[null,null,"","",""]
[null,null,"","",""]
[null,null,"","",""]
[null,null,"","",""]

{"sheet":"S2","index":5,"n_rows":282,"n_cols":16,"rows_kept":282,"cut":false,"hidden":false,"merged":[]}
[]
["設定"]
[]
["日付調整","選択日付","検索文字","表示文字","リスト","リンク","Cut1","Cut2","Cut3","Rap/","Rap2日","Rap３早","Rap４遅","Rap５夜","Rap６明","Rap７休"]
[null,"2017/11/",null,null,null,{"$f":"勤務合わせ!D9&\"/\"&勤務合わせ!D8&\"/\"&勤務合わせ!D7&\"/\"&勤務合わせ!D6","v":"―///"},{"$f":"LEFT(F5,LEN(F5)-(RIGHT(F5,1)=\"/\"))","v":"―//"},{"$f":"LEFT(G5,LEN(G5)-(RIGHT(G5,1)=\"/\"))","v":"―/"},{"$f":"LEFT(H5,LEN(H5)-(RIGHT(H5,1)=\"/\"))","v":"―"},{"$f":"SUBSTITUTE(I5,\"//\",\"/＿/\")","v":"―"},{"$f":"SUBSTITUTE(J5,$C$7,$D$7)","v":"―"},{"$f":"SUBSTITUTE(K5,$C$10,$D$10)","v":"―"},{"$f":"SUBSTITUTE(L5,$C$13,$D$13)","v":"―"},{"$f":"SUBSTITUTE(M5,$C$16,$D$16)","v":"―"},{"$f":"SUBSTITUTE(N5,$C$19,$D$19)","v":"―"},{"$f":"SUBSTITUTE(O5,$C$22,$D$22)","v":"―"}]
["選択年月日","2017-12-01","日勤","日勤",{"$f":"D7","v":"日"},{"$f":"勤務合わせ!E9&\"/\"&勤務合わせ!E8&\"/\"&勤務合わせ!E7&\"/\"&勤務合わせ!E6","v":"公///"},{"$f":"LEFT(F6,LEN(F6)-(RIGHT(F6,1)=\"/\"))","v":"公//"},"公/","公",{"$f":"SUBSTITUTE(I6,\"//\",\"/＿/\")","v":"公"},{"$f":"SUBSTITUTE(J6,$C$7,$D$7)","v":"公"},{"$f":"SUBSTITUTE(K6,$C$10,$D$10)","v":"公"},{"$f":"SUBSTITUTE(L6,$C$13,$D$13)","v":"公"},{"$f":"SUBSTITUTE(M6,$C$16,$D$16)","v":"公"},{"$f":"SUBSTITUTE(N6,$C$19,$D$19)","v":"公"},{"$f":"SUBSTITUTE(O6,$C$22,$D$22)","v":"休"}]
[{"$f":"(勤務合わせ!C$5)-1","v":"2022-11-30"},"2018-01-01","○","日",{"$f":"D10","v":"早"},{"$f":"勤務合わせ!F9&\"/\"&勤務合わせ!F8&\"/\"&勤務合わせ!F7&\"/\"&勤務合わせ!F6","v":"―///"},"―//","―/","―","―","―","―","―","―","―","―"]
[null,"2018-02-01",null,null,{"$f":"D13","v":"遅"},{"$f":"勤務合わせ!G9&\"/\"&勤務合わせ!G8&\"/\"&勤務合わせ!G7&\"/\"&勤務合わせ!G6","v":"―///"},"―//","―/","―","―","―","―","―","―","―","―"]
["選択月","2018-03-01","早出","早出",{"$f":"D16","v":"―"},{"$f":"勤務合わせ!H9&\"/\"&勤務合わせ!H8&\"/\"&勤務合わせ!H7&\"/\"&勤務合わせ!H6","v":"公///"},"公//","公/","公","公","公","公","公","公","公","休"]
[{"$f":"MONTH(A7)","v":11},"2018-04-01","①","早",{"$f":"D19","v":"―"},{"$f":"勤務合わせ!I9&\"/\"&勤務合わせ!I8&\"/\"&勤務合わせ!I7&\"/\"&勤務合わせ!I6","v":"公///"},"公//","公/","公","公","公","公","公","公","公","休"]
[null,"2018-05-01",null,null,{"$f":"D22","v":"休"},{"$f":"勤務合わせ!J9&\"/\"&勤務合わせ!J8&\"/\"&勤務合わせ!J7&\"/\"&勤務合わせ!J6","v":"①///"},"①//","①/","①","①","①","早","早",{"$f":"SUBSTITUTE(M11,$C$16,$D$16)","v":"早"},"早","早"]
["当直医","2018-06-01","遅出","遅出",{"$f":"D25","v":"有"},{"$f":"勤務合わせ!K9&\"/\"&勤務合わせ!K8&\"/\"&勤務合わせ!K7&\"/\"&勤務合わせ!K6","v":"―///"},"―//","―/","―","―","―","―","―","―","―","―"]
[null,"2018-07-01","②","遅",{"$f":"D28","v":"研"},{"$f":"勤務合わせ!L9&\"/\"&勤務合わせ!L8&\"/\"&勤務合わせ!L7&\"/\"&勤務合わせ!L6","v":"―///"},"―//","―/","―","―","―","―","―","―","―","―"]
["石井","2018-08-01",null,null,null,{"$f":"勤務合わせ!M9&\"/\"&勤務合わせ!M8&\"/\"&勤務合わせ!M7&\"/\"&勤務合わせ!M6","v":"有///"},"有//","有/","有","有","有","有","有","有","有","有"]
["井上","2018-09-01","夜勤入り","夜勤入り",null,{"$f":"勤務合わせ!N9&\"/\"&勤務合わせ!N8&\"/\"&勤務合わせ!N7&\"/\"&勤務合わせ!N6","v":"有///"},"有//","有/","有","有","有","有","有","有","有","有"]
["安井","2018-10-01","―","―",null,{"$f":"勤務合わせ!O9&\"/\"&勤務合わせ!O8&\"/\"&勤務合わせ!O7&\"/\"&勤務合わせ!O6","v":"公///"},"公//","公/","公","公","公","公","公","公","公","休"]
["田中","2018-11-01",null,null,null,{"$f":"勤務合わせ!P9&\"/\"&勤務合わせ!P8&\"/\"&勤務合わせ!P7&\"/\"&勤務合わせ!P6","v":"公///"},"公//","公/","公","公","公","公","公","公","公","休"]
["江川","2018-12-01","夜勤明け","夜勤明け",null,{"$f":"勤務合わせ!Q9&\"/\"&勤務合わせ!Q8&\"/\"&勤務合わせ!Q7&\"/\"&勤務合わせ!Q6","v":"〇///"},"〇//","〇/","〇","〇","〇","〇","〇","〇","〇","〇"]
["竹田","2019-01-01","―","―",null,{"$f":"勤務合わせ!R9&\"/\"&勤務合わせ!R8&\"/\"&勤務合わせ!R7&\"/\"&勤務合わせ!R6","v":"公///"},"公//","公/","公","公","公","公","公","公","公","休"]
["畑部","2019-02-01",null,null,null,{"$f":"勤務合わせ!S9&\"/\"&勤務合わせ!S8&\"/\"&勤務合わせ!S7&\"/\"&勤務合わせ!S6","v":"〇///"},"〇//","〇/","〇","〇","〇","〇","〇","〇","〇","〇"]
["村山","2019-03-01","公休","公休",null,{"$f":"勤務合わせ!T9&\"/\"&勤務合わせ!T8&\"/\"&勤務合わせ!T7&\"/\"&勤務合わせ!T6","v":"―///"},"―//","―/","―","―","―","―","―","―","―","―"]
["辰元","2019-04-01","公","休",null,{"$f":"勤務合わせ!U9&\"/\"&勤務合わせ!U8&\"/\"&勤務合わせ!U7&\"/\"&勤務合わせ!U6","v":"―///"},{"$f":"LEFT(F22,LEN(F22)-(RIGHT(F22,1)=\"/\"))","v":"―//"},"―/","―","―","―","―","―","―","―","―"]
["小倉","2019-05-01",null,null,null,{"$f":"勤務合わせ!V9&\"/\"&勤務合わせ!V8&\"/\"&勤務合わせ!V7&\"/\"&勤務合わせ!V6","v":"公///"},"公//","公/","公","公","公","公","公","公","公","休"]
["木村","2019-06-01","有休","有休",null,{"$f":"勤務合わせ!W9&\"/\"&勤務合わせ!W8&\"/\"&勤務合わせ!W7&\"/\"&勤務合わせ!W6","v":"①///"},"①//","①/","①","①","①","早","早","早","早","早"]
["本山","2019-07-01","有","有",null,{"$f":"勤務合わせ!X9&\"/\"&勤務合わせ!X8&\"/\"&勤務合わせ!X7&\"/\"&勤務合わせ!X6","v":"〇///"},"〇//","〇/","〇","〇","〇","〇","〇","〇","〇","〇"]
["浪花","2019-08-01",null,null,null,{"$f":"勤務合わせ!Y9&\"/\"&勤務合わせ!Y8&\"/\"&勤務合わせ!Y7&\"/\"&勤務合わせ!Y6","v":"公///"},"公//","公/","公","公","公","公","公","公","公","休"]
["比嘉","2019-09-01","研修","研修",null,{"$f":"勤務合わせ!Z9&\"/\"&勤務合わせ!Z8&\"/\"&勤務合わせ!Z7&\"/\"&勤務合わせ!Z6","v":"①///"},"①//","①/","①","①","①","早","早","早","早","早"]
["生嶋 ","2019-10-01","研","研",null,{"$f":"勤務合わせ!AA9&\"/\"&勤務合わせ!AA8&\"/\"&勤務合わせ!AA7&\"/\"&勤務合わせ!AA6","v":"―///"},"―//","―/","―","―","―","―","―","―","―","―"]
["升井","2019-11-01",null,null,null,{"$f":"勤務合わせ!AB9&\"/\"&勤務合わせ!AB8&\"/\"&勤務合わせ!AB7&\"/\"&勤務合わせ!AB6","v":"―///"},"―//","―/","―","―","―","―","―","―","―","―"]
[null,"2019-12-01",null,null,null,{"$f":"勤務合わせ!AC9&\"/\"&勤務合わせ!AC8&\"/\"&勤務合わせ!AC7&\"/\"&勤務合わせ!AC6","v":"公///"},"公//","公/","公","公","公","公","公","公","公","休"]
[null,"2020-01-01",null,null,null,{"$f":"勤務合わせ!AD9&\"/\"&勤務合わせ!AD8&\"/\"&勤務合わせ!AD7&\"/\"&勤務合わせ!AD6","v":"―///"},"―//","―/","―","―","―","―","―","―","―","―"]
[null,"2020-02-01",null,null,null,{"$f":"勤務合わせ!AE9&\"/\"&勤務合わせ!AE8&\"/\"&勤務合わせ!AE7&\"/\"&勤務合わせ!AE6","v":"―///"},"―//","―/","―","―","―","―","―","―","―","―"]
[null,"2020-03-01",null,null,null,{"$f":"勤務合わせ!AF9&\"/\"&勤務合わせ!AF8&\"/\"&勤務合わせ!AF7&\"/\"&勤務合わせ!AF6","v":"公///"},"公//","公/","公","公","公","公","公","公","公","休"]
[null,"2020-04-01",null,null,null,{"$f":"勤務合わせ!AG9&\"/\"&勤務合わせ!AG8&\"/\"&勤務合わせ!AG7&\"/\"&勤務合わせ!AG6","v":"〇///"},"〇//","〇/","〇","〇","〇","〇","〇","〇","〇","〇"]
[null,"2020-05-01",null,null,null,{"$f":"勤務合わせ!AH9&\"/\"&勤務合わせ!AH8&\"/\"&勤務合わせ!AH7&\"/\"&勤務合わせ!AH6","v":"―///"},"―//","―/","―","―","―","―","―","―","―","―"]
[null,"2020-06-01"]
["勤務医","2020-07-01"]
[null,"2020-08-01"]
["院長","2020-09-01"]
["松岡","2020-10-01"]
["竹田","2020-11-01"]
["末永","2020-12-01"]
["村山","2021-01-01"]
["植村","2021-02-01"]
["島野","2021-03-01"]
["伊達","2021-04-01"]
["畑部","2021-05-01"]
["吉村","2021-06-01"]
["江川","2021-07-01"]
["小幡","2021-08-01"]
["（サブ）","2021-09-01"]
[null,"2021-10-01"]
[null,"2021-11-01"]
[null,"2021-12-01"]
[null,"2022-01-01"]
[null,"2022-02-01"]
[null,"2022-03-01"]
[null,"2022-04-01"]
[null,"2022-05-01"]
[null,"2022-06-01"]
[null,"2022-07-01"]
[null,"2022-08-01"]
[null,"2022-09-01"]
[null,"2022-10-01"]
[null,"2022-11-01"]
[null,"2022-12-01"]
[null,"2023-01-01"]
[null,"2023-02-01"]
[null,"2023-03-01"]
[null,"2023-04-01"]
[null,"2023-05-01"]
[null,"2023-06-01"]
[null,"2023-07-01"]
[null,"2023-08-01"]
[null,"2023-09-01"]
[null,"2023-10-01"]
[null,"2023-11-01"]
[null,"2023-12-01"]
[null,"2024-01-01"]
[null,"2024-02-01"]
[null,"2024-03-01"]
[null,"2024-04-01"]
[null,"2024-05-01"]
[null,"2024-06-01"]
[null,"2024-07-01"]
[null,"2024-08-01"]
[null,"2024-09-01"]
[null,"2024-10-01"]
[null,"2024-11-01"]
[null,"2024-12-01"]
[null,"2025-01-01"]
[null,"2025-02-01"]
[null,"2025-03-01"]
[null,"2025-04-01"]
[null,"2025-05-01"]
[null,"2025-06-01"]
[null,"2025-07-01"]
[null,"2025-08-01"]
[null,"2025-09-01"]
[null,"2025-10-01"]
[null,"2025-11-01"]
[null,"2025-12-01"]
[null,"2026-01-01"]
[null,"2026-02-01"]
[null,"2026-03-01"]
[null,"2026-04-01"]
[null,"2026-05-01"]
[null,"2026-06-01"]
[null,"2026-07-01"]
[null,"2026-08-01"]
[null,"2026-09-01"]
[null,"2026-10-01"]
[null,"2026-11-01"]
[null,"2026-12-01"]
[null,"2027-01-01"]
[null,"2027-02-01"]
[null,"2027-03-01"]
[null,"2027-04-01"]
[null,"2027-05-01"]
[null,"2027-06-01"]
[null,"2027-07-01"]
[null,"2027-08-01"]
[null,"2027-09-01"]
[null,"2027-10-01"]
[null,"2027-11-01"]
[null,"2027-12-01"]
[null,"2028-01-01"]
[null,"2028-02-01"]
[null,"2028-03-01"]
[null,"2028-04-01"]
[null,"2028-05-01"]
[null,"2028-06-01"]
[null,"2028-07-01"]
[null,"2028-08-01"]
[null,"2028-09-01"]
[null,"2028-10-01"]
[null,"2028-11-01"]
[null,"2028-12-01"]
[null,"2029-01-01"]
[null,"2029-02-01"]
[null,"2029-03-01"]
[null,"2029-04-01"]
[null,"2029-05-01"]
[null,"2029-06-01"]
[null,"2029-07-01"]
[null,"2029-08-01"]
[null,"2029-09-01"]
[null,"2029-10-01"]
[null,"2029-11-01"]
[null,"2029-12-01"]
[null,"2030-01-01"]
[null,"2030-02-01"]
[null,"2030-03-01"]
[null,"2030-04-01"]
[null,"2030-05-01"]
[null,"2030-06-01"]
[null,"2030-07-01"]
[null,"2030-08-01"]
[null,"2030-09-01"]
[null,"2030-10-01"]
[null,"2030-11-01"]
[null,"2030-12-01"]
[null,"2031-01-01"]
[null,"2031-02-01"]
[null,"2031-03-01"]
[null,"2031-04-01"]
[null,"2031-05-01"]
[null,"2031-06-01"]
[null,"2031-07-01"]
[null,"2031-08-01"]
[null,"2031-09-01"]
[null,"2031-10-01"]
[null,"2031-11-01"]
[null,"2031-12-01"]
[null,"2032-01-01"]
[null,"2032-02-01"]
[null,"2032-03-01"]
[null,"2032-04-01"]
[null,"2032-05-01"]
[null,"2032-06-01"]
[null,"2032-07-01"]
[null,"2032-08-01"]
[null,"2032-09-01"]
[null,"2032-10-01"]
[null,"2032-11-01"]
[null,"2032-12-01"]
[null,"2033-01-01"]
[null,"2033-02-01"]
[null,"2033-03-01"]
[null,"2033-04-01"]
[null,"2033-05-01"]
[null,"2033-06-01"]
[null,"2033-07-01"]
[null,"2033-08-01"]
[null,"2033-09-01"]
[null,"2033-10-01"]
[null,"2033-11-01"]
[null,"2033-12-01"]
[null,"2034-01-01"]
[null,"2034-02-01"]
[null,"2034-03-01"]
[null,"2034-04-01"]
[null,"2034-05-01"]
[null,"2034-06-01"]
[null,"2034-07-01"]
[null,"2034-08-01"]
[null,"2034-09-01"]
[null,"2034-10-01"]
[null,"2034-11-01"]
[null,"2034-12-01"]
[null,"2035-01-01"]
[null,"2035-02-01"]
[null,"2035-03-01"]
[null,"2035-04-01"]
[null,"2035-05-01"]
[null,"2035-06-01"]
[null,"2035-07-01"]
[null,"2035-08-01"]
[null,"2035-09-01"]
[null,"2035-10-01"]
[null,"2035-11-01"]
[null,"2035-12-01"]
[null,"2036-01-01"]
[null,"2036-02-01"]
[null,"2036-03-01"]
[null,"2036-04-01"]
[null,"2036-05-01"]
[null,"2036-06-01"]
[null,"2036-07-01"]
[null,"2036-08-01"]
[null,"2036-09-01"]
[null,"2036-10-01"]
[null,"2036-11-01"]
[null,"2036-12-01"]
[null,"2037-01-01"]
[null,"2037-02-01"]
[null,"2037-03-01"]
[null,"2037-04-01"]
[null,"2037-05-01"]
[null,"2037-06-01"]
[null,"2037-07-01"]
[null,"2037-08-01"]
[null,"2037-09-01"]
[null,"2037-10-01"]
[null,"2037-11-01"]
[null,"2037-12-01"]
[null,"2038-01-01"]
[null,"2038-02-01"]
[null,"2038-03-01"]
[null,"2038-04-01"]
[null,"2038-05-01"]
[null,"2038-06-01"]
[null,"2038-07-01"]
[null,"2038-08-01"]
[null,"2038-09-01"]
[null,"2038-10-01"]
[null,"2038-11-01"]
[null,"2038-12-01"]
[null,"2039-01-01"]
[null,"2039-02-01"]
[null,"2039-03-01"]
[null,"2039-04-01"]
[null,"2039-05-01"]
[null,"2039-06-01"]
[null,"2039-07-01"]
[null,"2039-08-01"]
[null,"2039-09-01"]
[null,"2039-10-01"]
[null,"2039-11-01"]
[null,"2039-12-01"]
[null,"2040-01-01"]
[null,"2040-02-01"]
[null,"2040-03-01"]
[null,"2040-04-01"]
[null,"2040-05-01"]
[null,"2040-06-01"]
[null,"2040-07-01"]
[null,"2040-08-01"]
[null,"2040-09-01"]
[null,"2040-10-01"]
[null,"2040-11-01"]
[null,"2040-12-01"]

{"sheet":"S3","index":6,"n_rows":31,"n_cols":3,"rows_kept":31,"cut":false,"hidden":false,"merged":[]}
[{"$f":"勤務表!D4","v":"木"},"―/日","、、"]
[{"$f":"勤務表!E4","v":"金"},"―/日","、、"]
[{"$f":"勤務表!F4","v":"土"},"休/休","、、"]
[{"$f":"勤務表!G4","v":"日"},"〇/日","、、"]
[{"$f":"勤務表!H4","v":"月"},"休/休","、、"]
[{"$f":"勤務表!I4","v":"火"},"遅/休","、、"]
[{"$f":"勤務表!J4","v":"水"},"―/日","、、"]
[{"$f":"勤務表!K4","v":"木"},"―/日","、、"]
[{"$f":"勤務表!L4","v":"金"},"〇/日","、、"]
[{"$f":"勤務表!M4","v":"土"},"〇/日","、、"]
[{"$f":"勤務表!N4","v":"日"},"〇/日","、、"]
[{"$f":"勤務表!O4","v":"月"},"―/休","、、"]
[{"$f":"勤務表!P4","v":"火"},"―/休","、、"]
[{"$f":"勤務表!Q4","v":"水"},"休/日","、、"]
[{"$f":"勤務表!R4","v":"木"},"休/日","、、"]
[{"$f":"勤務表!S4","v":"金"},"〇/日","、、"]
[{"$f":"勤務表!T4","v":"土"},"休/日","、、"]
[{"$f":"勤務表!U4","v":"日"},"早/日","、、"]
[{"$f":"勤務表!V4","v":"月"},"―/休","、、"]
[{"$f":"勤務表!W4","v":"火"},"―/休","、、"]
[{"$f":"勤務表!X4","v":"水"},"休/日","、、"]
[{"$f":"勤務表!Y4","v":"木"},"休/日","、、"]
[{"$f":"勤務表!Z4","v":"金"},"〇/休","、、"]
[{"$f":"勤務表!AA4","v":"土"},"〇/日","、、"]
[{"$f":"勤務表!AB4","v":"日"},"休/日","、、"]
[{"$f":"勤務表!AC4","v":"月"},"有/休","、、"]
[{"$f":"勤務表!AD4","v":"火"},"休/休","、、"]
[{"$f":"勤務表!AE4","v":"水"},"〇/日","、、"]
[{"$f":"勤務表!AF4","v":"木"},"〇/日","、、"]
[{"$f":"勤務表!AG4","v":"金"},"―/日","、、"]
[{"$f":"勤務表!AH4","v":"土"},"","、、"]